{"text_format":"1","workbook":"xlsx","n_sheets":7,"sheets":["Series Table","Blorenge Downhill","Blorenge Uphill","Pentyrch Hill Race","Mynydd Pen Y Fal","Craig Yr Allt","Tintern Trot"],"not_rendered":{"charts":0,"images":1,"macros":1,"external_links":1,"defined_names":26,"comments":0,"pivot_tables":0},"unopened":[],"bounds":{"document_bytes":16777216,"sheet_cells":100000,"rows_first":2000,"rows_last":500,"rows_between":2000,"halvings":0,"cell_chars":16384,"cell_head_chars":4096},"cells_cut":0,"cells_raw":0,"read":"whole","date_system":"1900"}

{"sheet":"Series Table","index":0,"n_rows":324,"n_cols":19,"rows_kept":324,"cut":false,"hidden":false,"merged":[]}
[null,"South Wales 2016 Mid Week Series",null,null,null,null,"Blorenge Downhill",null,"Blorenge Uphill",null,"Pentyrch Hill Race",null,"Mynydd Pen Y Fal",null,"Craig Yr Allt",null,"Tintern Trot"]
["Pos","Name","Club","Gender","Cat.","Total","Time","Score","Time","Score","Time","Score","Time","Score","Time","Score","Time","Competed","Ave (Best 4)"]
[{"$f":"ROW(A1)","v":1},"Matt Stott",{"$f":"IFERROR(VLOOKUP(B3,INDIRECT(\"'\"&$G$1&\"'!\"&\"$C$2:$H$200\"),2,FALSE),\"\")","v":"MDC"},{"$f":"IFERROR(VLOOKUP(B3,INDIRECT(\"'\"&$G$1&\"'!\"&\"$C$2:$H$200\"),3,FALSE),\"\")","v":"M"},{"$f":"IFERROR(VLOOKUP(B3,INDIRECT(\"'\"&$G$1&\"'!\"&\"$C$2:$H$200\"),4,FALSE),\"\")","v":"MU40"},{"$f":"SUM(LARGE((H3,J3,L3,N3,P3),{1,2,3,4,5}))","v":312.98625046838691},{"$f":"IFERROR(VLOOKUP(B3,INDIRECT(\"'\"&$G$1&\"'!\"&\"$C$2:$H$200\"),5,FALSE),\"\")","v":"00:14:16"},{"$f":"IFERROR(VLOOKUP(B3,INDIRECT(\"'\"&$G$1&\"'!\"&\"$C$2:$H$200\"),6,FALSE),0)","v":108.03609798023204},{"$f":"IFERROR(VLOOKUP(B3,INDIRECT(\"'\"&$I$1&\"'!\"&\"$C$2:$G$200\"),5,FALSE),\"\")","v":1.9594907407407405E-2},{"$f":"IFERROR(VLOOKUP(B3,INDIRECT(\"'\"&$I$1&\"'!\"&\"$C$2:$H$200\"),6,FALSE),0)","v":105.40842552240477},{"$f":"IFERROR(VLOOKUP(B3,INDIRECT(\"'\"&$K$1&\"'!\"&\"$C$2:$G$400\"),5,FALSE),\"\")","v":""},{"$f":"IFERROR(VLOOKUP(B3,INDIRECT(\"'\"&$K$1&\"'!\"&\"$C$2:$H$400\"),6,FALSE),0)","v":0},{"$f":"IFERROR(VLOOKUP(B3,INDIRECT(\"'\"&$M$1&\"'!\"&\"$C$2:$H$200\"),5,FALSE),\"\")","v":2.8923611111111108E-2},{"$f":"IFERROR(VLOOKUP(B3,INDIRECT(\"'\"&$M$1&\"'!\"&\"$C$2:$H$200\"),6,FALSE),0)","v":99.541726965750115},{"$f":"IFERROR(VLOOKUP(B3,INDIRECT(\"'\"&$O$1&\"'!\"&\"$C$2:$G$200\"),4,FALSE),\"\")","v":""},{"$f":"IFERROR(VLOOKUP(B3,INDIRECT(\"'\"&$O$1&\"'!\"&\"$C$2:$G$200\"),5,FALSE),0)","v":0},{"$f":"IFERROR(VLOOKUP(B3,INDIRECT(\"'\"&$Q$1&\"'!\"&\"$C$2:$G$200\"),4,FALSE),\"\")","v":""},{"$f":"6-COUNTIF(G3:Q3,\"\")","v":3},{"$f":"F3/IF(R3>4,5,R3)","v":104.32875015612898}]
[2,"Paul Tucker","U/A","M","MO50",{"$f":"SUM(LARGE((H4,J4,L4,N4,P4),{1,2,3,4,5}))","v":259.39313323987642},"00:17:19",88.375590889557373,2.5416666666666667E-2,77.304726785115662,"",0,3.0601851851851852E-2,93.712815565203414,"",0,"",3,86.464377746625473]
[3,"Mark Buxton","MDC","M","MU40",{"$f":"SUM(LARGE((H5,J5,L5,N5,P5),{1,2,3,4,5}))","v":235.31744531537899},"00:19:22",75.161151697464561,2.478009259259259E-2,80.377695831936563,2.2624999999999997,79.778597785977865,"",0,"",0,"",3,78.439148438459668]
[4,"Chris Jones","MDC","M","MU40",{"$f":"SUM(LARGE((H6,J6,L6,N6,P6),{1,2,3,4,5}))","v":210.65522514225313},"00:14:17",107.92866351525569,2.0150462962962964E-2,102.72656162699745,"",0,"",0,"",0,"",2,105.32761257112656]
[5,"Andy Stott","MDC","M","M050",{"$f":"SUM(LARGE((H7,J7,L7,N7,P7),{1,2,3,4,5}))","v":206.79310882539019},"00:19:36",73.657069187795415,3.005787037037037E-2,54.899988825567128,"",0,3.5057870370370371E-2,78.236050812027642,"",0,"",3,68.931036275130069]
[6,"Paul Murrin","Chepstow Harriers","M","MO40",{"$f":"SUM(LARGE((H8,J8,L8,N8,P8),{1,2,3,4,5}))","v":204.18361019467477},"00:15:37",99.333906317146543,1.9710648148148147E-2,104.84970387752823,"",0,"",0,"",0,"",2,102.09180509733739]
[7,"Iwan Morton",{"$f":"IFERROR(VLOOKUP(B9,INDIRECT(\"'\"&$M$1&\"'!\"&\"$C$2:$H$400\"),2,FALSE),\"\")","v":"MMRT"},{"$f":"IFERROR(VLOOKUP(B9,INDIRECT(\"'\"&$M$1&\"'!\"&\"$C$2:$H$400\"),3,FALSE),\"\")","v":"M"},{"$f":"IFERROR(VLOOKUP(B9,INDIRECT(\"'\"&$M$1&\"'!\"&\"$C$2:$H$400\"),4,FALSE),\"\")","v":"MU40"},{"$f":"SUM(LARGE((H9,J9,L9,N9,P9),{1,2,3,4,5}))","v":200.40240923393313},"",0,"",0,1.8854166666666667,99.81549815498154,2.8622685185185185E-2,100.58691107895159,"",0,"",2,100.20120461696656]
[8,"Oscar Partridge",{"$f":"IFERROR(VLOOKUP(B10,INDIRECT(\"'\"&$K$1&\"'!\"&\"$C$2:$H$200\"),2,FALSE),\"\")","v":"Mynydd Du"},{"$f":"IFERROR(VLOOKUP(B10,INDIRECT(\"'\"&$K$1&\"'!\"&\"$C$2:$H$200\"),3,FALSE),\"\")","v":"M"},{"$f":"IFERROR(VLOOKUP(B10,INDIRECT(\"'\"&$K$1&\"'!\"&\"$C$2:$H$200\"),4,FALSE),\"\")","v":"MU40"},{"$f":"SUM(LARGE((H10,J10,L10,N10,P10),{1,2,3,4,5}))","v":197.11558852202126},"",0,"",0,1.9381944444444443,97.011070110701112,2.8761574074074075E-2,100.10451841132016,"",0,"",2,98.557794261010628]
[9,"David Jenkins",{"$f":"IFERROR(VLOOKUP(B11,INDIRECT(\"'\"&$G$1&\"'!\"&\"$C$2:$H$200\"),2,FALSE),\"\")","v":"Forest of Dean Athletics Club"},{"$f":"IFERROR(VLOOKUP(B11,INDIRECT(\"'\"&$G$1&\"'!\"&\"$C$2:$H$200\"),3,FALSE),\"\")","v":"M"},{"$f":"IFERROR(VLOOKUP(B11,INDIRECT(\"'\"&$G$1&\"'!\"&\"$C$2:$H$200\"),4,FALSE),\"\")","v":"MU40"},{"$f":"SUM(LARGE((H11,J11,L11,N11,P11),{1,2,3,4,5}))","v":195.26581919138101},"00:22:16",56.467554791577143,2.8518518518518523E-2,62.330986702424852,"",0,3.5567129629629629E-2,76.467277697379004,"",0,"",3,65.088606397127009]
[10,"Ed Dickson",{"$f":"IFERROR(VLOOKUP(B12,INDIRECT(\"'\"&$G$1&\"'!\"&\"$C$2:$H$200\"),2,FALSE),\"\")","v":"MDC"},{"$f":"IFERROR(VLOOKUP(B12,INDIRECT(\"'\"&$G$1&\"'!\"&\"$C$2:$H$200\"),3,FALSE),\"\")","v":"M"},{"$f":"IFERROR(VLOOKUP(B12,INDIRECT(\"'\"&$G$1&\"'!\"&\"$C$2:$H$200\"),4,FALSE),\"\")","v":"MU40"},{"$f":"SUM(LARGE((H12,J12,L12,N12,P12),{1,2,3,4,5}))","v":182.20939043252457},"00:16:38",92.780403953588333,2.2905092592592591E-2,89.428986478936224,"",0,"",0,"",0,"",2,91.104695216262286]
[11,"Ian Macklin",{"$f":"IFERROR(VLOOKUP(B13,INDIRECT(\"'\"&$K$1&\"'!\"&\"$C$2:$H$200\"),2,FALSE),\"\")","v":"Mynyddwyr de Cymru"},{"$f":"IFERROR(VLOOKUP(B13,INDIRECT(\"'\"&$K$1&\"'!\"&\"$C$2:$H$200\"),3,FALSE),\"\")","v":"M"},{"$f":"IFERROR(VLOOKUP(B13,INDIRECT(\"'\"&$K$1&\"'!\"&\"$C$2:$H$200\"),4,FALSE),\"\")","v":"MO40"},{"$f":"SUM(LARGE((H13,J13,L13,N13,P13),{1,2,3,4,5}))","v":180.53681463008553},"",0,"",0,2.2562500000000001,80.110701107011067,2.8668981481481479E-2,100.42611352307445,"",0,"",2,90.268407315042765]
[12,"John Aggleton",{"$f":"IFERROR(VLOOKUP(B14,INDIRECT(\"'\"&$K$1&\"'!\"&\"$C$2:$H$200\"),2,FALSE),\"\")","v":"Mynyddwyr de Cymru"},{"$f":"IFERROR(VLOOKUP(B14,INDIRECT(\"'\"&$K$1&\"'!\"&\"$C$2:$H$200\"),3,FALSE),\"\")","v":"M"},{"$f":"IFERROR(VLOOKUP(B14,INDIRECT(\"'\"&$K$1&\"'!\"&\"$C$2:$H$200\"),4,FALSE),\"\")","v":"MO60"},{"$f":"SUM(LARGE((H14,J14,L14,N14,P14),{1,2,3,4,5}))","v":180.37394035300696},"",0,"",0,2.2388888888888889,81.033210332103309,2.8981481481481483E-2,99.340730020903663,"",0,"",2,90.186970176503479]
[13,"Martin Driscoll",{"$f":"IFERROR(VLOOKUP(B15,INDIRECT(\"'\"&$G$1&\"'!\"&\"$C$2:$H$200\"),2,FALSE),\"\")","v":"MDC"},{"$f":"IFERROR(VLOOKUP(B15,INDIRECT(\"'\"&$G$1&\"'!\"&\"$C$2:$H$200\"),3,FALSE),\"\")","v":"M"},{"$f":"IFERROR(VLOOKUP(B15,INDIRECT(\"'\"&$G$1&\"'!\"&\"$C$2:$H$200\"),4,FALSE),\"\")","v":"MU40"},{"$f":"SUM(LARGE((H15,J15,L15,N15,P15),{1,2,3,4,5}))","v":179.61787761359636},"00:16:46",91.920928233777403,2.326388888888889E-2,87.696949379818975,"",0,"",0,"",0,"",2,89.808938806798182]
[14,"Helen Brown",{"$f":"IFERROR(VLOOKUP(B16,INDIRECT(\"'\"&$G$1&\"'!\"&\"$C$2:$H$200\"),2,FALSE),\"\")","v":"Mynydd Du"},{"$f":"IFERROR(VLOOKUP(B16,INDIRECT(\"'\"&$G$1&\"'!\"&\"$C$2:$H$200\"),3,FALSE),\"\")","v":"F"},{"$f":"IFERROR(VLOOKUP(B16,INDIRECT(\"'\"&$G$1&\"'!\"&\"$C$2:$H$200\"),4,FALSE),\"\")","v":"FO40"},{"$f":"SUM(LARGE((H16,J16,L16,N16,P16),{1,2,3,4,5}))","v":177.55507345905073},"00:17:00",90.416845724108285,2.3379629629629629E-2,87.138227734942461,"",0,"",0,"",0,"",2,88.777536729525366]
[15,"Mark Burley",{"$f":"IFERROR(VLOOKUP(B17,INDIRECT(\"'\"&$G$1&\"'!\"&\"$C$2:$H$200\"),2,FALSE),\"\")","v":"Bristol and West Athletics Club"},{"$f":"IFERROR(VLOOKUP(B17,INDIRECT(\"'\"&$G$1&\"'!\"&\"$C$2:$H$200\"),3,FALSE),\"\")","v":"M"},{"$f":"IFERROR(VLOOKUP(B17,INDIRECT(\"'\"&$G$1&\"'!\"&\"$C$2:$H$200\"),4,FALSE),\"\")","v":"MU40"},{"$f":"SUM(LARGE((H17,J17,L17,N17,P17),{1,2,3,4,5}))","v":176.73469865022747},"00:17:43",85.797163730124623,2.2592592592592591E-2,90.937534920102834,"",0,"",0,"",0,"",2,88.367349325113736]
[16,"Oliver Lamford",{"$f":"IFERROR(VLOOKUP(B18,INDIRECT(\"'\"&$K$1&\"'!\"&\"$C$2:$H$200\"),2,FALSE),\"\")","v":"Mynyddwyr de Cymru"},{"$f":"IFERROR(VLOOKUP(B18,INDIRECT(\"'\"&$K$1&\"'!\"&\"$C$2:$H$200\"),3,FALSE),\"\")","v":"M"},{"$f":"IFERROR(VLOOKUP(B18,INDIRECT(\"'\"&$K$1&\"'!\"&\"$C$2:$H$200\"),4,FALSE),\"\")","v":"MU40"},{"$f":"SUM(LARGE((H18,J18,L18,N18,P18),{1,2,3,4,5}))","v":167.68180359082893},"",0,"",0,2.4104166666666669,71.918819188191875,3.0011574074074076E-2,95.762984402637059,"",0,"",2,83.840901795414467]
[17,"Gary Davies",{"$f":"IFERROR(VLOOKUP(B19,INDIRECT(\"'\"&$K$1&\"'!\"&\"$C$2:$H$200\"),2,FALSE),\"\")","v":"Mynyddwyr de Cymru"},{"$f":"IFERROR(VLOOKUP(B19,INDIRECT(\"'\"&$K$1&\"'!\"&\"$C$2:$H$200\"),3,FALSE),\"\")","v":"M"},{"$f":"IFERROR(VLOOKUP(B19,INDIRECT(\"'\"&$K$1&\"'!\"&\"$C$2:$H$200\"),4,FALSE),\"\")","v":"MU40"},{"$f":"SUM(LARGE((H19,J19,L19,N19,P19),{1,2,3,4,5}))","v":167.22641423230442},"",0,"",0,2.4076388888888887,72.06642066420666,3.0185185185185186E-2,95.159993568097761,"",0,"",2,83.613207116152211]
[18,"Andrew Dickens",{"$f":"IFERROR(VLOOKUP(B20,INDIRECT(\"'\"&$K$1&\"'!\"&\"$C$2:$H$200\"),2,FALSE),\"\")","v":"Mynydd Du"},{"$f":"IFERROR(VLOOKUP(B20,INDIRECT(\"'\"&$K$1&\"'!\"&\"$C$2:$H$200\"),3,FALSE),\"\")","v":"M"},{"$f":"IFERROR(VLOOKUP(B20,INDIRECT(\"'\"&$K$1&\"'!\"&\"$C$2:$H$200\"),4,FALSE),\"\")","v":"MO40"},{"$f":"SUM(LARGE((H20,J20,L20,N20,P20),{1,2,3,4,5}))","v":166.76626028199502},"",0,"",0,2.3784722222222223,73.616236162361616,3.0763888888888886E-2,93.1500241196334,"",0,"",2,83.383130140997508]
[19,"Andrew Dickens",{"$f":"IFERROR(VLOOKUP(B21,INDIRECT(\"'\"&$M$1&\"'!\"&\"$C$2:$H$400\"),2,FALSE),\"\")","v":"Mynydd Du"},{"$f":"IFERROR(VLOOKUP(B21,INDIRECT(\"'\"&$M$1&\"'!\"&\"$C$2:$H$400\"),3,FALSE),\"\")","v":"M"},{"$f":"IFERROR(VLOOKUP(B21,INDIRECT(\"'\"&$M$1&\"'!\"&\"$C$2:$H$400\"),4,FALSE),\"\")","v":"MO40"},{"$f":"SUM(LARGE((H21,J21,L21,N21,P21),{1,2,3,4,5}))","v":166.76626028199502},"",0,"",0,2.3784722222222223,73.616236162361616,3.0763888888888886E-2,93.1500241196334,"",0,"",2,83.383130140997508]
[20,"Jamie Clode",{"$f":"IFERROR(VLOOKUP(B22,INDIRECT(\"'\"&$K$1&\"'!\"&\"$C$2:$H$200\"),2,FALSE),\"\")","v":"Bridgend AC"},{"$f":"IFERROR(VLOOKUP(B22,INDIRECT(\"'\"&$K$1&\"'!\"&\"$C$2:$H$200\"),3,FALSE),\"\")","v":"M"},{"$f":"IFERROR(VLOOKUP(B22,INDIRECT(\"'\"&$K$1&\"'!\"&\"$C$2:$H$200\"),4,FALSE),\"\")","v":"MU40"},{"$f":"SUM(LARGE((H22,J22,L22,N22,P22),{1,2,3,4,5}))","v":166.18502161866772},"",0,"",0,2.2645833333333334,79.667896678966784,3.2673611111111105E-2,86.517124939700935,"",0,"",2,83.092510809333859]
[21,"Jamie Clode",{"$f":"IFERROR(VLOOKUP(B23,INDIRECT(\"'\"&$M$1&\"'!\"&\"$C$2:$H$400\"),2,FALSE),\"\")","v":"Bridgend AC"},{"$f":"IFERROR(VLOOKUP(B23,INDIRECT(\"'\"&$M$1&\"'!\"&\"$C$2:$H$400\"),3,FALSE),\"\")","v":"M"},{"$f":"IFERROR(VLOOKUP(B23,INDIRECT(\"'\"&$M$1&\"'!\"&\"$C$2:$H$400\"),4,FALSE),\"\")","v":"MU40"},{"$f":"SUM(LARGE((H23,J23,L23,N23,P23),{1,2,3,4,5}))","v":166.18502161866772},"",0,"",0,2.2645833333333334,79.667896678966784,3.2673611111111105E-2,86.517124939700935,"",0,"",2,83.092510809333859]
[22,"Steve Harrhy",{"$f":"IFERROR(VLOOKUP(B24,INDIRECT(\"'\"&$G$1&\"'!\"&\"$C$2:$H$200\"),2,FALSE),\"\")","v":"Pontypool"},{"$f":"IFERROR(VLOOKUP(B24,INDIRECT(\"'\"&$G$1&\"'!\"&\"$C$2:$H$200\"),3,FALSE),\"\")","v":"M"},{"$f":"IFERROR(VLOOKUP(B24,INDIRECT(\"'\"&$G$1&\"'!\"&\"$C$2:$H$200\"),4,FALSE),\"\")","v":"MO50"},{"$f":"SUM(LARGE((H24,J24,L24,N24,P24),{1,2,3,4,5}))","v":156.5651594051821},"00:18:09",83.003867640739145,2.6192129629629631E-2,73.56129176444297,"",0,"",0,"",0,"",2,78.28257970259105]
[23,"Lou Summers",{"$f":"IFERROR(VLOOKUP(B25,INDIRECT(\"'\"&$K$1&\"'!\"&\"$C$2:$H$200\"),2,FALSE),\"\")","v":"Mynydd Du"},{"$f":"IFERROR(VLOOKUP(B25,INDIRECT(\"'\"&$K$1&\"'!\"&\"$C$2:$H$200\"),3,FALSE),\"\")","v":"F"},{"$f":"IFERROR(VLOOKUP(B25,INDIRECT(\"'\"&$K$1&\"'!\"&\"$C$2:$H$200\"),4,FALSE),\"\")","v":"FO40"},{"$f":"SUM(LARGE((H25,J25,L25,N25,P25),{1,2,3,4,5}))","v":156.53215446770969},"",0,"",0,2.4243055555555553,71.180811808118108,3.3009259259259259E-2,85.351342659591566,"",0,"",2,78.266077233854844]
[24,"Rona Davies",{"$f":"IFERROR(VLOOKUP(B26,INDIRECT(\"'\"&$G$1&\"'!\"&\"$C$2:$H$200\"),2,FALSE),\"\")","v":"Mynydd Du"},{"$f":"IFERROR(VLOOKUP(B26,INDIRECT(\"'\"&$G$1&\"'!\"&\"$C$2:$H$200\"),3,FALSE),\"\")","v":"F"},{"$f":"IFERROR(VLOOKUP(B26,INDIRECT(\"'\"&$G$1&\"'!\"&\"$C$2:$H$200\"),4,FALSE),\"\")","v":"FU40"},{"$f":"SUM(LARGE((H26,J26,L26,N26,P26),{1,2,3,4,5}))","v":147.80323382058378},"00:21:42",60.120326600773531,"",0,"",0,3.2337962962962964E-2,87.682907219810247,"",0,"",2,73.901616910291892]
[25,"Daniel Morgan",{"$f":"IFERROR(VLOOKUP(B27,INDIRECT(\"'\"&$K$1&\"'!\"&\"$C$2:$H$200\"),2,FALSE),\"\")","v":"Bridgend AC"},{"$f":"IFERROR(VLOOKUP(B27,INDIRECT(\"'\"&$K$1&\"'!\"&\"$C$2:$H$200\"),3,FALSE),\"\")","v":"M"},{"$f":"IFERROR(VLOOKUP(B27,INDIRECT(\"'\"&$K$1&\"'!\"&\"$C$2:$H$200\"),4,FALSE),\"\")","v":"MU40"},{"$f":"SUM(LARGE((H27,J27,L27,N27,P27),{1,2,3,4,5}))","v":140.40510303800579},"",0,"",0,2.7951388888888888,51.476014760147606,3.1979166666666663E-2,88.929088277858199,"",0,"",2,70.202551519002895]
[26,"Daniel Morgan",{"$f":"IFERROR(VLOOKUP(B28,INDIRECT(\"'\"&$M$1&\"'!\"&\"$C$2:$H$400\"),2,FALSE),\"\")","v":"Bridgend AC"},{"$f":"IFERROR(VLOOKUP(B28,INDIRECT(\"'\"&$M$1&\"'!\"&\"$C$2:$H$400\"),3,FALSE),\"\")","v":"M"},{"$f":"IFERROR(VLOOKUP(B28,INDIRECT(\"'\"&$M$1&\"'!\"&\"$C$2:$H$400\"),4,FALSE),\"\")","v":"MU40"},{"$f":"SUM(LARGE((H28,J28,L28,N28,P28),{1,2,3,4,5}))","v":140.40510303800579},"",0,"",0,2.7951388888888888,51.476014760147606,3.1979166666666663E-2,88.929088277858199,"",0,"",2,70.202551519002895]
[27,"Karen Elvers",{"$f":"IFERROR(VLOOKUP(B29,INDIRECT(\"'\"&$K$1&\"'!\"&\"$C$2:$H$200\"),2,FALSE),\"\")","v":"Mynyddwyr de Cymru"},{"$f":"IFERROR(VLOOKUP(B29,INDIRECT(\"'\"&$K$1&\"'!\"&\"$C$2:$H$200\"),3,FALSE),\"\")","v":"F"},{"$f":"IFERROR(VLOOKUP(B29,INDIRECT(\"'\"&$K$1&\"'!\"&\"$C$2:$H$200\"),4,FALSE),\"\")","v":"FO40"},{"$f":"SUM(LARGE((H29,J29,L29,N29,P29),{1,2,3,4,5}))","v":132.05939541305688},"",0,"",0,2.6715277777777775,58.044280442804428,3.6273148148148145E-2,74.015114970252455,"",0,"",2,66.029697706528438]
[28,"John Price",{"$f":"IFERROR(VLOOKUP(B30,INDIRECT(\"'\"&$G$1&\"'!\"&\"$C$2:$H$200\"),2,FALSE),\"\")","v":"Hay Hotfooters"},{"$f":"IFERROR(VLOOKUP(B30,INDIRECT(\"'\"&$G$1&\"'!\"&\"$C$2:$H$200\"),3,FALSE),\"\")","v":"M"},{"$f":"IFERROR(VLOOKUP(B30,INDIRECT(\"'\"&$G$1&\"'!\"&\"$C$2:$H$200\"),4,FALSE),\"\")","v":"MO50"},{"$f":"SUM(LARGE((H30,J30,L30,N30,P30),{1,2,3,4,5}))","v":123.36212625365262},"00:23:35",47.980232058444372,"",0,"",0,3.5879629629629629E-2,75.381894195208247,"",0,"",2,61.681063126826309]
[29,"John Price",{"$f":"IFERROR(VLOOKUP(B31,INDIRECT(\"'\"&$M$1&\"'!\"&\"$C$2:$H$400\"),2,FALSE),\"\")","v":"Hay Hotfooters"},{"$f":"IFERROR(VLOOKUP(B31,INDIRECT(\"'\"&$M$1&\"'!\"&\"$C$2:$H$400\"),3,FALSE),\"\")","v":"M"},{"$f":"IFERROR(VLOOKUP(B31,INDIRECT(\"'\"&$M$1&\"'!\"&\"$C$2:$H$400\"),4,FALSE),\"\")","v":"MO50"},{"$f":"SUM(LARGE((H31,J31,L31,N31,P31),{1,2,3,4,5}))","v":123.36212625365262},"00:23:35",47.980232058444372,"",0,"",0,3.5879629629629629E-2,75.381894195208247,"",0,"",2,61.681063126826309]
[30,"Meshari Alsaeed",{"$f":"IFERROR(VLOOKUP(B32,INDIRECT(\"'\"&$G$1&\"'!\"&\"$C$2:$H$200\"),2,FALSE),\"\")","v":"MDC"},{"$f":"IFERROR(VLOOKUP(B32,INDIRECT(\"'\"&$G$1&\"'!\"&\"$C$2:$H$200\"),3,FALSE),\"\")","v":"M"},{"$f":"IFERROR(VLOOKUP(B32,INDIRECT(\"'\"&$G$1&\"'!\"&\"$C$2:$H$200\"),4,FALSE),\"\")","v":"MU23"},{"$f":"SUM(LARGE((H32,J32,L32,N32,P32),{1,2,3,4,5}))","v":105.27269962149549},"00:21:36",60.76493339063169,3.2210648148148148E-2,44.507766230863808,"",0,"",0,"",0,"",2,52.636349810747745]
[31,"Katy Benson",{"$f":"IFERROR(VLOOKUP(B33,INDIRECT(\"'\"&$G$1&\"'!\"&\"$C$2:$H$200\"),2,FALSE),\"\")","v":"MDC"},{"$f":"IFERROR(VLOOKUP(B33,INDIRECT(\"'\"&$G$1&\"'!\"&\"$C$2:$H$200\"),3,FALSE),\"\")","v":"F"},{"$f":"IFERROR(VLOOKUP(B33,INDIRECT(\"'\"&$G$1&\"'!\"&\"$C$2:$H$200\"),4,FALSE),\"\")","v":"FU40"},{"$f":"SUM(LARGE((H33,J33,L33,N33,P33),{1,2,3,4,5}))","v":105.15695756351839},"00:22:01",58.079071766222597,3.1678240740740743E-2,47.077885797295792,"",0,"",0,"",0,"",2,52.578478781759195]
[32,"Daniel Bodman",{"$f":"IFERROR(VLOOKUP(B34,INDIRECT(\"'\"&$K$1&\"'!\"&\"$C$2:$H$200\"),2,FALSE),\"\")","v":"Aberdare VAAC"},{"$f":"IFERROR(VLOOKUP(B34,INDIRECT(\"'\"&$K$1&\"'!\"&\"$C$2:$H$200\"),3,FALSE),\"\")","v":"M"},{"$f":"IFERROR(VLOOKUP(B34,INDIRECT(\"'\"&$K$1&\"'!\"&\"$C$2:$H$200\"),4,FALSE),\"\")","v":"MU40"},{"$f":"SUM(LARGE((H34,J34,L34,N34,P34),{1,2,3,4,5}))","v":101.88191881918817},"",0,"",0,1.846527777777778,101.88191881918817,"",0,"",0,"",1,101.88191881918817]
[33,"Peter Ryder",{"$f":"IFERROR(VLOOKUP(B35,INDIRECT(\"'\"&$K$1&\"'!\"&\"$C$2:$H$200\"),2,FALSE),\"\")","v":"Cardiff AAC"},{"$f":"IFERROR(VLOOKUP(B35,INDIRECT(\"'\"&$K$1&\"'!\"&\"$C$2:$H$200\"),3,FALSE),\"\")","v":"M"},{"$f":"IFERROR(VLOOKUP(B35,INDIRECT(\"'\"&$K$1&\"'!\"&\"$C$2:$H$200\"),4,FALSE),\"\")","v":"MU40"},{"$f":"SUM(LARGE((H35,J35,L35,N35,P35),{1,2,3,4,5}))","v":101.29151291512915},"",0,"",0,1.8576388888888891,101.29151291512915,"",0,"",0,"",1,101.29151291512915]
[34,"Matthew Lawson",{"$f":"IFERROR(VLOOKUP(B36,INDIRECT(\"'\"&$M$1&\"'!\"&\"$C$2:$H$400\"),2,FALSE),\"\")","v":"Chepstow Harriers"},{"$f":"IFERROR(VLOOKUP(B36,INDIRECT(\"'\"&$M$1&\"'!\"&\"$C$2:$H$400\"),3,FALSE),\"\")","v":"M"},{"$f":"IFERROR(VLOOKUP(B36,INDIRECT(\"'\"&$M$1&\"'!\"&\"$C$2:$H$400\"),4,FALSE),\"\")","v":"MO40"},{"$f":"SUM(LARGE((H36,J36,L36,N36,P36),{1,2,3,4,5}))","v":99.220131853995824},"",0,"",0,"",0,2.90162037037037E-2,99.220131853995824,"",0,"",1,99.220131853995824]
[35,"Ricahrd Cronin","MDC","M","MU40",{"$f":"SUM(LARGE((H37,J37,L37,N37,P37),{1,2,3,4,5}))","v":97.250361794500705},"",0,"",0,"",0,2.9583333333333336E-2,97.250361794500705,"",0,"",1,97.250361794500705]
[36,"Jason King","LMRT","M","M040",{"$f":"SUM(LARGE((H38,J38,L38,N38,P38),{1,2,3,4,5}))","v":95.682585624698518},"",0,"",0,"",0,3.0034722222222223E-2,95.682585624698518,"",0,"",1,95.682585624698518]
[37,"Mike Fawcett","LMRT","M","MO40",{"$f":"SUM(LARGE((H39,J39,L39,N39,P39),{1,2,3,4,5}))","v":95.481588679852081},"",0,"",0,"",0,3.0092592592592591E-2,95.481588679852081,"",0,"",1,95.481588679852081]
[38,"Dan Sandford","Forest of Dean AC","M","MO40",{"$f":"SUM(LARGE((H40,J40,L40,N40,P40),{1,2,3,4,5}))","v":94.476603955619879},"",0,"",0,"",0,3.0381944444444444E-2,94.476603955619879,"",0,"",1,94.476603955619879]
[39,"Andy Creber","Chepstow Harriers","M","MO50",{"$f":"SUM(LARGE((H41,J41,L41,N41,P41),{1,2,3,4,5}))","v":94.235407621804157},"",0,"",0,"",0,3.0451388888888889E-2,94.235407621804157,"",0,"",1,94.235407621804157]
[40,"Jack Brown",{"$f":"IFERROR(VLOOKUP(B42,INDIRECT(\"'\"&$K$1&\"'!\"&\"$C$2:$H$200\"),2,FALSE),\"\")","v":"Unattached"},{"$f":"IFERROR(VLOOKUP(B42,INDIRECT(\"'\"&$K$1&\"'!\"&\"$C$2:$H$200\"),3,FALSE),\"\")","v":"M"},{"$f":"IFERROR(VLOOKUP(B42,INDIRECT(\"'\"&$K$1&\"'!\"&\"$C$2:$H$200\"),4,FALSE),\"\")","v":"MU40"},{"$f":"SUM(LARGE((H42,J42,L42,N42,P42),{1,2,3,4,5}))","v":94.059040590405885},"",0,"",0,1.9937500000000001,94.059040590405885,"",0,"",0,"",1,94.059040590405885]
[41,"Julian Boon",{"$f":"IFERROR(VLOOKUP(B43,INDIRECT(\"'\"&$M$1&\"'!\"&\"$C$2:$H$400\"),2,FALSE),\"\")","v":"Forest of Dean AC"},{"$f":"IFERROR(VLOOKUP(B43,INDIRECT(\"'\"&$M$1&\"'!\"&\"$C$2:$H$400\"),3,FALSE),\"\")","v":"M"},{"$f":"IFERROR(VLOOKUP(B43,INDIRECT(\"'\"&$M$1&\"'!\"&\"$C$2:$H$400\"),4,FALSE),\"\")","v":"MO40"},{"$f":"SUM(LARGE((H43,J43,L43,N43,P43),{1,2,3,4,5}))","v":93.913812510049837},"",0,"",0,"",0,3.0543981481481481E-2,93.913812510049837,"",0,"",1,93.913812510049837]
[42,"Darren Bishop",{"$f":"IFERROR(VLOOKUP(B44,INDIRECT(\"'\"&$K$1&\"'!\"&\"$C$2:$H$200\"),2,FALSE),\"\")","v":"Pontypridd Roadents"},{"$f":"IFERROR(VLOOKUP(B44,INDIRECT(\"'\"&$K$1&\"'!\"&\"$C$2:$H$200\"),3,FALSE),\"\")","v":"M"},{"$f":"IFERROR(VLOOKUP(B44,INDIRECT(\"'\"&$K$1&\"'!\"&\"$C$2:$H$200\"),4,FALSE),\"\")","v":"MU40"},{"$f":"SUM(LARGE((H44,J44,L44,N44,P44),{1,2,3,4,5}))","v":93.690036900368995},"",0,"",0,2.0006944444444446,93.690036900368995,"",0,"",0,"",1,93.690036900368995]
[43,"James Woodier",{"$f":"IFERROR(VLOOKUP(B45,INDIRECT(\"'\"&$M$1&\"'!\"&\"$C$2:$H$400\"),2,FALSE),\"\")","v":"Mynydd Du"},{"$f":"IFERROR(VLOOKUP(B45,INDIRECT(\"'\"&$M$1&\"'!\"&\"$C$2:$H$400\"),3,FALSE),\"\")","v":"M"},{"$f":"IFERROR(VLOOKUP(B45,INDIRECT(\"'\"&$M$1&\"'!\"&\"$C$2:$H$400\"),4,FALSE),\"\")","v":"MU40"},{"$f":"SUM(LARGE((H45,J45,L45,N45,P45),{1,2,3,4,5}))","v":93.351021064479809},"",0,"",0,"",0,3.0706018518518521E-2,93.351021064479809,"",0,"",1,93.351021064479809]
[44,"Paul Graham",{"$f":"IFERROR(VLOOKUP(B46,INDIRECT(\"'\"&$K$1&\"'!\"&\"$C$2:$H$200\"),2,FALSE),\"\")","v":"Pontypridd Roadents"},{"$f":"IFERROR(VLOOKUP(B46,INDIRECT(\"'\"&$K$1&\"'!\"&\"$C$2:$H$200\"),3,FALSE),\"\")","v":"M"},{"$f":"IFERROR(VLOOKUP(B46,INDIRECT(\"'\"&$K$1&\"'!\"&\"$C$2:$H$200\"),4,FALSE),\"\")","v":"MU40"},{"$f":"SUM(LARGE((H46,J46,L46,N46,P46),{1,2,3,4,5}))","v":91.771217712177105},"",0,"",0,2.0368055555555555,91.771217712177105,"",0,"",0,"",1,91.771217712177105]
[45,"Emma Bayliss",{"$f":"IFERROR(VLOOKUP(B47,INDIRECT(\"'\"&$M$1&\"'!\"&\"$C$2:$H$400\"),2,FALSE),\"\")","v":"Mynydd Du"},{"$f":"IFERROR(VLOOKUP(B47,INDIRECT(\"'\"&$M$1&\"'!\"&\"$C$2:$H$400\"),3,FALSE),\"\")","v":"F"},{"$f":"IFERROR(VLOOKUP(B47,INDIRECT(\"'\"&$M$1&\"'!\"&\"$C$2:$H$400\"),4,FALSE),\"\")","v":"FU40"},{"$f":"SUM(LARGE((H47,J47,L47,N47,P47),{1,2,3,4,5}))","v":91.099855282199727},"",0,"",0,"",0,3.1354166666666662E-2,91.099855282199727,"",0,"",1,91.099855282199727]
[46,"Roger Milss",{"$f":"IFERROR(VLOOKUP(B48,INDIRECT(\"'\"&$M$1&\"'!\"&\"$C$2:$H$400\"),2,FALSE),\"\")","v":"Mynydd Du/Vegan Runners"},{"$f":"IFERROR(VLOOKUP(B48,INDIRECT(\"'\"&$M$1&\"'!\"&\"$C$2:$H$400\"),3,FALSE),\"\")","v":"M"},{"$f":"IFERROR(VLOOKUP(B48,INDIRECT(\"'\"&$M$1&\"'!\"&\"$C$2:$H$400\"),4,FALSE),\"\")","v":"MO40"},{"$f":"SUM(LARGE((H48,J48,L48,N48,P48),{1,2,3,4,5}))","v":90.53706383662967},"",0,"",0,"",0,3.1516203703703706E-2,90.53706383662967,"",0,"",1,90.53706383662967]
[47,"Mark Matthews",{"$f":"IFERROR(VLOOKUP(B49,INDIRECT(\"'\"&$M$1&\"'!\"&\"$C$2:$H$400\"),2,FALSE),\"\")","v":"Forest of Dean AC"},{"$f":"IFERROR(VLOOKUP(B49,INDIRECT(\"'\"&$M$1&\"'!\"&\"$C$2:$H$400\"),3,FALSE),\"\")","v":"M"},{"$f":"IFERROR(VLOOKUP(B49,INDIRECT(\"'\"&$M$1&\"'!\"&\"$C$2:$H$400\"),4,FALSE),\"\")","v":"MO40"},{"$f":"SUM(LARGE((H49,J49,L49,N49,P49),{1,2,3,4,5}))","v":90.13506994693681},"",0,"",0,"",0,3.1631944444444442E-2,90.13506994693681,"",0,"",1,90.13506994693681]
[48,"Alun Wood",{"$f":"IFERROR(VLOOKUP(B50,INDIRECT(\"'\"&$K$1&\"'!\"&\"$C$2:$H$200\"),2,FALSE),\"\")","v":"Mynydd Du"},{"$f":"IFERROR(VLOOKUP(B50,INDIRECT(\"'\"&$K$1&\"'!\"&\"$C$2:$H$200\"),3,FALSE),\"\")","v":"M"},{"$f":"IFERROR(VLOOKUP(B50,INDIRECT(\"'\"&$K$1&\"'!\"&\"$C$2:$H$200\"),4,FALSE),\"\")","v":"MU40"},{"$f":"SUM(LARGE((H50,J50,L50,N50,P50),{1,2,3,4,5}))","v":89.520295202952042},"",0,"",0,2.0791666666666666,89.520295202952042,"",0,"",0,"",1,89.520295202952042]
[49,"Gareth Crossway",{"$f":"IFERROR(VLOOKUP(B51,INDIRECT(\"'\"&$K$1&\"'!\"&\"$C$2:$H$200\"),2,FALSE),\"\")","v":"Unattached"},{"$f":"IFERROR(VLOOKUP(B51,INDIRECT(\"'\"&$K$1&\"'!\"&\"$C$2:$H$200\"),3,FALSE),\"\")","v":"M"},{"$f":"IFERROR(VLOOKUP(B51,INDIRECT(\"'\"&$K$1&\"'!\"&\"$C$2:$H$200\"),4,FALSE),\"\")","v":"MU40"},{"$f":"SUM(LARGE((H51,J51,L51,N51,P51),{1,2,3,4,5}))","v":89.335793357933582},"",0,"",0,2.0826388888888889,89.335793357933582,"",0,"",0,"",1,89.335793357933582]
[50,"Lee Mills",{"$f":"IFERROR(VLOOKUP(B52,INDIRECT(\"'\"&$K$1&\"'!\"&\"$C$2:$H$200\"),2,FALSE),\"\")","v":"Islwyn RC"},{"$f":"IFERROR(VLOOKUP(B52,INDIRECT(\"'\"&$K$1&\"'!\"&\"$C$2:$H$200\"),3,FALSE),\"\")","v":"M"},{"$f":"IFERROR(VLOOKUP(B52,INDIRECT(\"'\"&$K$1&\"'!\"&\"$C$2:$H$200\"),4,FALSE),\"\")","v":"MU40"},{"$f":"SUM(LARGE((H52,J52,L52,N52,P52),{1,2,3,4,5}))","v":89.003690036900366},"",0,"",0,2.088888888888889,89.003690036900366,"",0,"",0,"",1,89.003690036900366]
[51,"Justin Ross",{"$f":"IFERROR(VLOOKUP(B53,INDIRECT(\"'\"&$M$1&\"'!\"&\"$C$2:$H$400\"),2,FALSE),\"\")","v":"Mynydd Du"},{"$f":"IFERROR(VLOOKUP(B53,INDIRECT(\"'\"&$M$1&\"'!\"&\"$C$2:$H$400\"),3,FALSE),\"\")","v":"M"},{"$f":"IFERROR(VLOOKUP(B53,INDIRECT(\"'\"&$M$1&\"'!\"&\"$C$2:$H$400\"),4,FALSE),\"\")","v":"MU40"},{"$f":"SUM(LARGE((H53,J53,L53,N53,P53),{1,2,3,4,5}))","v":88.567293777134594},"",0,"",0,"",0,3.2083333333333332E-2,88.567293777134594,"",0,"",1,88.567293777134594]
[52,"Dafydd Lambeth",{"$f":"IFERROR(VLOOKUP(B54,INDIRECT(\"'\"&$K$1&\"'!\"&\"$C$2:$H$200\"),2,FALSE),\"\")","v":"Islwyn RC"},{"$f":"IFERROR(VLOOKUP(B54,INDIRECT(\"'\"&$K$1&\"'!\"&\"$C$2:$H$200\"),3,FALSE),\"\")","v":"M"},{"$f":"IFERROR(VLOOKUP(B54,INDIRECT(\"'\"&$K$1&\"'!\"&\"$C$2:$H$200\"),4,FALSE),\"\")","v":"MO40"},{"$f":"SUM(LARGE((H54,J54,L54,N54,P54),{1,2,3,4,5}))","v":88.044280442804407},"",0,"",0,2.1069444444444447,88.044280442804407,"",0,"",0,"",1,88.044280442804407]
[53,"Peter Coles",{"$f":"IFERROR(VLOOKUP(B55,INDIRECT(\"'\"&$K$1&\"'!\"&\"$C$2:$H$200\"),2,FALSE),\"\")","v":"Pontypridd Roadents"},{"$f":"IFERROR(VLOOKUP(B55,INDIRECT(\"'\"&$K$1&\"'!\"&\"$C$2:$H$200\"),3,FALSE),\"\")","v":"M"},{"$f":"IFERROR(VLOOKUP(B55,INDIRECT(\"'\"&$K$1&\"'!\"&\"$C$2:$H$200\"),4,FALSE),\"\")","v":"MO50"},{"$f":"SUM(LARGE((H55,J55,L55,N55,P55),{1,2,3,4,5}))","v":87.084870848708491},"",0,"",0,2.125,87.084870848708491,"",0,"",0,"",1,87.084870848708491]
[54,"Clara Evans",{"$f":"IFERROR(VLOOKUP(B56,INDIRECT(\"'\"&$K$1&\"'!\"&\"$C$2:$H$200\"),2,FALSE),\"\")","v":"Pontypridd Roadents"},{"$f":"IFERROR(VLOOKUP(B56,INDIRECT(\"'\"&$K$1&\"'!\"&\"$C$2:$H$200\"),3,FALSE),\"\")","v":"F"},{"$f":"IFERROR(VLOOKUP(B56,INDIRECT(\"'\"&$K$1&\"'!\"&\"$C$2:$H$200\"),4,FALSE),\"\")","v":"FU40"},{"$f":"SUM(LARGE((H56,J56,L56,N56,P56),{1,2,3,4,5}))","v":86.789667896678964},"",0,"",0,2.1305555555555555,86.789667896678964,"",0,"",0,"",1,86.789667896678964]
[55,"Owen Morris",{"$f":"IFERROR(VLOOKUP(B57,INDIRECT(\"'\"&$K$1&\"'!\"&\"$C$2:$H$200\"),2,FALSE),\"\")","v":"Unattached"},{"$f":"IFERROR(VLOOKUP(B57,INDIRECT(\"'\"&$K$1&\"'!\"&\"$C$2:$H$200\"),3,FALSE),\"\")","v":"M"},{"$f":"IFERROR(VLOOKUP(B57,INDIRECT(\"'\"&$K$1&\"'!\"&\"$C$2:$H$200\"),4,FALSE),\"\")","v":"MU40"},{"$f":"SUM(LARGE((H57,J57,L57,N57,P57),{1,2,3,4,5}))","v":86.383763837638355},"",0,"",0,2.1381944444444447,86.383763837638355,"",0,"",0,"",1,86.383763837638355]
[56,"Hywel James",{"$f":"IFERROR(VLOOKUP(B58,INDIRECT(\"'\"&$M$1&\"'!\"&\"$C$2:$H$400\"),2,FALSE),\"\")","v":"U/A"},{"$f":"IFERROR(VLOOKUP(B58,INDIRECT(\"'\"&$M$1&\"'!\"&\"$C$2:$H$400\"),3,FALSE),\"\")","v":"M"},{"$f":"IFERROR(VLOOKUP(B58,INDIRECT(\"'\"&$M$1&\"'!\"&\"$C$2:$H$400\"),4,FALSE),\"\")","v":"MU40"},{"$f":"SUM(LARGE((H58,J58,L58,N58,P58),{1,2,3,4,5}))","v":86.155330438977316},"",0,"",0,"",0,3.2777777777777781E-2,86.155330438977316,"",0,"",1,86.155330438977316]
[57,"Philip Williams",{"$f":"IFERROR(VLOOKUP(B59,INDIRECT(\"'\"&$K$1&\"'!\"&\"$C$2:$H$200\"),2,FALSE),\"\")","v":"Pontypridd Roadents"},{"$f":"IFERROR(VLOOKUP(B59,INDIRECT(\"'\"&$K$1&\"'!\"&\"$C$2:$H$200\"),3,FALSE),\"\")","v":"M"},{"$f":"IFERROR(VLOOKUP(B59,INDIRECT(\"'\"&$K$1&\"'!\"&\"$C$2:$H$200\"),4,FALSE),\"\")","v":"MU40"},{"$f":"SUM(LARGE((H59,J59,L59,N59,P59),{1,2,3,4,5}))","v":85.756457564575641},"",0,"",0,2.15,85.756457564575641,"",0,"",0,"",1,85.756457564575641]
[58,"Jon Thiel",{"$f":"IFERROR(VLOOKUP(B60,INDIRECT(\"'\"&$M$1&\"'!\"&\"$C$2:$H$400\"),2,FALSE),\"\")","v":"Bridgend AC"},{"$f":"IFERROR(VLOOKUP(B60,INDIRECT(\"'\"&$M$1&\"'!\"&\"$C$2:$H$400\"),3,FALSE),\"\")","v":"M"},{"$f":"IFERROR(VLOOKUP(B60,INDIRECT(\"'\"&$M$1&\"'!\"&\"$C$2:$H$400\"),4,FALSE),\"\")","v":"MU40"},{"$f":"SUM(LARGE((H60,J60,L60,N60,P60),{1,2,3,4,5}))","v":85.552339604438004},"",0,"",0,"",0,3.2951388888888891E-2,85.552339604438004,"",0,"",1,85.552339604438004]
[59,"Rob Sage",{"$f":"IFERROR(VLOOKUP(B61,INDIRECT(\"'\"&$K$1&\"'!\"&\"$C$2:$H$200\"),2,FALSE),\"\")","v":"Les Croupiers RC"},{"$f":"IFERROR(VLOOKUP(B61,INDIRECT(\"'\"&$K$1&\"'!\"&\"$C$2:$H$200\"),3,FALSE),\"\")","v":"M"},{"$f":"IFERROR(VLOOKUP(B61,INDIRECT(\"'\"&$K$1&\"'!\"&\"$C$2:$H$200\"),4,FALSE),\"\")","v":"MU40"},{"$f":"SUM(LARGE((H61,J61,L61,N61,P61),{1,2,3,4,5}))","v":85.535055350553506},"",0,"",0,2.1541666666666668,85.535055350553506,"",0,"",0,"",1,85.535055350553506]
[60,"Andrew Jones","Unattached","M","MO40",{"$f":"SUM(LARGE((H62,J62,L62,N62,P62),{1,2,3,4,5}))","v":84.538745387453872},"",0,"",0,2.1729166666666666,84.538745387453872,"",0,"",0,"",1,84.538745387453872]
[61,"Neil Jones","Pontyclun Road Runners","M","MU40",{"$f":"SUM(LARGE((H63,J63,L63,N63,P63),{1,2,3,4,5}))","v":83.948339483394847},"",0,"",0,2.1840277777777777,83.948339483394847,"",0,"",0,"",1,83.948339483394847]
[62,"Oliver Burrows","Unattached","M","MU40",{"$f":"SUM(LARGE((H64,J64,L64,N64,P64),{1,2,3,4,5}))","v":83.321033210332104},"",0,"",0,2.1958333333333333,83.321033210332104,"",0,"",0,"",1,83.321033210332104]
[63,"Richard Jackson-Hookins","Penarth & Dinas Runners","M","MU40",{"$f":"SUM(LARGE((H65,J65,L65,N65,P65),{1,2,3,4,5}))","v":83.210332103321051},"",0,"",0,2.1979166666666665,83.210332103321051,"",0,"",0,"",1,83.210332103321051]
[64,"Gethin Powell","White Rock Runners","M","MU40",{"$f":"SUM(LARGE((H66,J66,L66,N66,P66),{1,2,3,4,5}))","v":83.173431734317347},"",0,"",0,2.1986111111111111,83.173431734317347,"",0,"",0,"",1,83.173431734317347]
[{"$f":"ROW(A65)","v":65},"Anthony Bannon","San Domenico RC","M","MU40",{"$f":"SUM(LARGE((H67,J67,L67,N67,P67),{1,2,3,4,5}))","v":83.062730627306252},{"$f":"IFERROR(VLOOKUP(B67,INDIRECT(\"'\"&$G$1&\"'!\"&\"$C$2:$H$200\"),5,FALSE),\"\")","v":""},{"$f":"IFERROR(VLOOKUP(B67,INDIRECT(\"'\"&$G$1&\"'!\"&\"$C$2:$H$200\"),6,FALSE),0)","v":0},{"$f":"IFERROR(VLOOKUP(B67,INDIRECT(\"'\"&$I$1&\"'!\"&\"$C$2:$G$200\"),5,FALSE),\"\")","v":""},{"$f":"IFERROR(VLOOKUP(B67,INDIRECT(\"'\"&$I$1&\"'!\"&\"$C$2:$H$200\"),6,FALSE),0)","v":0},{"$f":"IFERROR(VLOOKUP(B67,INDIRECT(\"'\"&$K$1&\"'!\"&\"$C$2:$G$400\"),5,FALSE),\"\")","v":2.2006944444444447},{"$f":"IFERROR(VLOOKUP(B67,INDIRECT(\"'\"&$K$1&\"'!\"&\"$C$2:$H$400\"),6,FALSE),0)","v":83.062730627306252},{"$f":"IFERROR(VLOOKUP(B67,INDIRECT(\"'\"&$M$1&\"'!\"&\"$C$2:$H$200\"),5,FALSE),\"\")","v":""},{"$f":"IFERROR(VLOOKUP(B67,INDIRECT(\"'\"&$M$1&\"'!\"&\"$C$2:$H$200\"),6,FALSE),0)","v":0},{"$f":"IFERROR(VLOOKUP(B67,INDIRECT(\"'\"&$O$1&\"'!\"&\"$C$2:$G$200\"),4,FALSE),\"\")","v":""},{"$f":"IFERROR(VLOOKUP(B67,INDIRECT(\"'\"&$O$1&\"'!\"&\"$C$2:$G$200\"),5,FALSE),0)","v":0},{"$f":"IFERROR(VLOOKUP(B67,INDIRECT(\"'\"&$Q$1&\"'!\"&\"$C$2:$G$200\"),4,FALSE),\"\")","v":""},{"$f":"6-COUNTIF(G67:Q67,\"\")","v":1},{"$f":"F67/IF(R67>4,5,R67)","v":83.062730627306252}]
[66,"Karl James","Neath Harriers","M","MO50",{"$f":"SUM(LARGE((H68,J68,L68,N68,P68),{1,2,3,4,5}))","v":82.730627306273078},"",0,"",0,2.2069444444444444,82.730627306273078,"",0,"",0,"",1,82.730627306273078]
[67,"Gareth Watkins",{"$f":"IFERROR(VLOOKUP(B69,INDIRECT(\"'\"&$M$1&\"'!\"&\"$C$2:$H$400\"),2,FALSE),\"\")","v":"MDC"},{"$f":"IFERROR(VLOOKUP(B69,INDIRECT(\"'\"&$M$1&\"'!\"&\"$C$2:$H$400\"),3,FALSE),\"\")","v":"M"},{"$f":"IFERROR(VLOOKUP(B69,INDIRECT(\"'\"&$M$1&\"'!\"&\"$C$2:$H$400\"),4,FALSE),\"\")","v":"MO60"},{"$f":"SUM(LARGE((H69,J69,L69,N69,P69),{1,2,3,4,5}))","v":82.57758482071074},"",0,"",0,"",0,3.380787037037037E-2,82.57758482071074,"",0,"",1,82.57758482071074]
[68,"Dave Buchanan",{"$f":"IFERROR(VLOOKUP(B70,INDIRECT(\"'\"&$K$1&\"'!\"&\"$C$2:$H$200\"),2,FALSE),\"\")","v":"San Domenico RC"},{"$f":"IFERROR(VLOOKUP(B70,INDIRECT(\"'\"&$K$1&\"'!\"&\"$C$2:$H$200\"),3,FALSE),\"\")","v":"M"},{"$f":"IFERROR(VLOOKUP(B70,INDIRECT(\"'\"&$K$1&\"'!\"&\"$C$2:$H$200\"),4,FALSE),\"\")","v":"MU40"},{"$f":"SUM(LARGE((H70,J70,L70,N70,P70),{1,2,3,4,5}))","v":82.398523985239862},"",0,"",0,2.2131944444444445,82.398523985239862,"",0,"",0,"",1,82.398523985239862]
[69,"Malcom O'Brien",{"$f":"IFERROR(VLOOKUP(B71,INDIRECT(\"'\"&$K$1&\"'!\"&\"$C$2:$H$200\"),2,FALSE),\"\")","v":"Unattached"},{"$f":"IFERROR(VLOOKUP(B71,INDIRECT(\"'\"&$K$1&\"'!\"&\"$C$2:$H$200\"),3,FALSE),\"\")","v":"M"},{"$f":"IFERROR(VLOOKUP(B71,INDIRECT(\"'\"&$K$1&\"'!\"&\"$C$2:$H$200\"),4,FALSE),\"\")","v":"MU40"},{"$f":"SUM(LARGE((H71,J71,L71,N71,P71),{1,2,3,4,5}))","v":82.324723247232484},"",0,"",0,2.2145833333333331,82.324723247232484,"",0,"",0,"",1,82.324723247232484]
[70,"Simon Thomas",{"$f":"IFERROR(VLOOKUP(B72,INDIRECT(\"'\"&$K$1&\"'!\"&\"$C$2:$H$200\"),2,FALSE),\"\")","v":"San Domenico RC"},{"$f":"IFERROR(VLOOKUP(B72,INDIRECT(\"'\"&$K$1&\"'!\"&\"$C$2:$H$200\"),3,FALSE),\"\")","v":"M"},{"$f":"IFERROR(VLOOKUP(B72,INDIRECT(\"'\"&$K$1&\"'!\"&\"$C$2:$H$200\"),4,FALSE),\"\")","v":"MO40"},{"$f":"SUM(LARGE((H72,J72,L72,N72,P72),{1,2,3,4,5}))","v":80.479704797047987},"",0,"",0,2.2493055555555554,80.479704797047987,"",0,"",0,"",1,80.479704797047987]
[71,"Jonathon Like",{"$f":"IFERROR(VLOOKUP(B73,INDIRECT(\"'\"&$G$1&\"'!\"&\"$C$2:$H$200\"),2,FALSE),\"\")","v":"U/A"},{"$f":"IFERROR(VLOOKUP(B73,INDIRECT(\"'\"&$G$1&\"'!\"&\"$C$2:$H$200\"),3,FALSE),\"\")","v":"M"},{"$f":"IFERROR(VLOOKUP(B73,INDIRECT(\"'\"&$G$1&\"'!\"&\"$C$2:$H$200\"),4,FALSE),\"\")","v":"MU40"},{"$f":"SUM(LARGE((H73,J73,L73,N73,P73),{1,2,3,4,5}))","v":80.318006016330031},"00:18:34",80.318006016330031,"",0,"",0,"",0,"",0,"",1,80.318006016330031]
[72,"Rhodri Evans",{"$f":"IFERROR(VLOOKUP(B74,INDIRECT(\"'\"&$K$1&\"'!\"&\"$C$2:$H$200\"),2,FALSE),\"\")","v":"Pontypridd Roadents"},{"$f":"IFERROR(VLOOKUP(B74,INDIRECT(\"'\"&$K$1&\"'!\"&\"$C$2:$H$200\"),3,FALSE),\"\")","v":"M"},{"$f":"IFERROR(VLOOKUP(B74,INDIRECT(\"'\"&$K$1&\"'!\"&\"$C$2:$H$200\"),4,FALSE),\"\")","v":"MO40"},{"$f":"SUM(LARGE((H74,J74,L74,N74,P74),{1,2,3,4,5}))","v":79.963099630996311},"",0,"",0,2.2590277777777779,79.963099630996311,"",0,"",0,"",1,79.963099630996311]
[73,"Matthew Forde","Unattached","M","MU40",{"$f":"SUM(LARGE((H75,J75,L75,N75,P75),{1,2,3,4,5}))","v":79.852398523985244},"",0,"",0,2.2611111111111111,79.852398523985244,"",0,"",0,"",1,79.852398523985244]
[74,"Peter Turnbull","Les Croupiers RC","M","MO50",{"$f":"SUM(LARGE((H76,J76,L76,N76,P76),{1,2,3,4,5}))","v":79.520295202952028},"",0,"",0,2.2673611111111112,79.520295202952028,"",0,"",0,"",1,79.520295202952028]
[75,"Patrick Lees","Cardiff Triathletes","M","MU40",{"$f":"SUM(LARGE((H77,J77,L77,N77,P77),{1,2,3,4,5}))","v":79.335793357933568},"",0,"",0,2.2708333333333335,79.335793357933568,"",0,"",0,"",1,79.335793357933568]
[76,"Richard Self","Les Croupiers RC","M","MO50",{"$f":"SUM(LARGE((H78,J78,L78,N78,P78),{1,2,3,4,5}))","v":78.856088560885595},"",0,"",0,2.2798611111111113,78.856088560885595,"",0,"",0,"",1,78.856088560885595]
[77,"Daniel Thrift","Unattached","M","MU40",{"$f":"SUM(LARGE((H79,J79,L79,N79,P79),{1,2,3,4,5}))","v":78.819188191881921},"",0,"",0,2.2805555555555554,78.819188191881921,"",0,"",0,"",1,78.819188191881921]
[78,"Andy Jones","Penarth & Dinas Runners","M","MU40",{"$f":"SUM(LARGE((H80,J80,L80,N80,P80),{1,2,3,4,5}))","v":78.782287822878217},"",0,"",0,2.28125,78.782287822878217,"",0,"",0,"",1,78.782287822878217]
[79,"Richard Cronin","Mynyddwyr de Cymru","M","MU40",{"$f":"SUM(LARGE((H81,J81,L81,N81,P81),{1,2,3,4,5}))","v":78.487084870848705},"",0,"",0,2.2868055555555555,78.487084870848705,"",0,"",0,"",1,78.487084870848705]
[80,"Katie Roby","Mynyddwyr de Cymru","F","FU40",{"$f":"SUM(LARGE((H82,J82,L82,N82,P82),{1,2,3,4,5}))","v":77.970479704797043},"",0,"",0,2.2965277777777779,77.970479704797043,"",0,"",0,"",1,77.970479704797043]
[81,"Paul Hayward","Islwyn RC","M","MU40",{"$f":"SUM(LARGE((H83,J83,L83,N83,P83),{1,2,3,4,5}))","v":77.822878228782315},"",0,"",0,2.2993055555555553,77.822878228782315,"",0,"",0,"",1,77.822878228782315]
[82,"Ben Watkins",{"$f":"IFERROR(VLOOKUP(B84,INDIRECT(\"'\"&$M$1&\"'!\"&\"$C$2:$H$400\"),2,FALSE),\"\")","v":"Mynydd Du"},{"$f":"IFERROR(VLOOKUP(B84,INDIRECT(\"'\"&$M$1&\"'!\"&\"$C$2:$H$400\"),3,FALSE),\"\")","v":"M"},{"$f":"IFERROR(VLOOKUP(B84,INDIRECT(\"'\"&$M$1&\"'!\"&\"$C$2:$H$400\"),4,FALSE),\"\")","v":"MU40"},{"$f":"SUM(LARGE((H84,J84,L84,N84,P84),{1,2,3,4,5}))","v":77.793857533365497},"",0,"",0,"",0,3.5185185185185187E-2,77.793857533365497,"",0,"",1,77.793857533365497]
[83,"Gareth Huw Griffiths",{"$f":"IFERROR(VLOOKUP(B85,INDIRECT(\"'\"&$K$1&\"'!\"&\"$C$2:$H$200\"),2,FALSE),\"\")","v":"Unattached"},{"$f":"IFERROR(VLOOKUP(B85,INDIRECT(\"'\"&$K$1&\"'!\"&\"$C$2:$H$200\"),3,FALSE),\"\")","v":"M"},{"$f":"IFERROR(VLOOKUP(B85,INDIRECT(\"'\"&$K$1&\"'!\"&\"$C$2:$H$200\"),4,FALSE),\"\")","v":"MO40"},{"$f":"SUM(LARGE((H85,J85,L85,N85,P85),{1,2,3,4,5}))","v":77.675276752767502},"",0,"",0,2.3020833333333335,77.675276752767502,"",0,"",0,"",1,77.675276752767502]
[84,"Mark Saunders",{"$f":"IFERROR(VLOOKUP(B86,INDIRECT(\"'\"&$K$1&\"'!\"&\"$C$2:$H$200\"),2,FALSE),\"\")","v":"Mynyddwyr de Cymru"},{"$f":"IFERROR(VLOOKUP(B86,INDIRECT(\"'\"&$K$1&\"'!\"&\"$C$2:$H$200\"),3,FALSE),\"\")","v":"M"},{"$f":"IFERROR(VLOOKUP(B86,INDIRECT(\"'\"&$K$1&\"'!\"&\"$C$2:$H$200\"),4,FALSE),\"\")","v":"MO50"},{"$f":"SUM(LARGE((H86,J86,L86,N86,P86),{1,2,3,4,5}))","v":77.380073800737989},"",0,"",0,2.307638888888889,77.380073800737989,"",0,"",0,"",1,77.380073800737989]
[85,"Ceri Davies",{"$f":"IFERROR(VLOOKUP(B87,INDIRECT(\"'\"&$K$1&\"'!\"&\"$C$2:$H$200\"),2,FALSE),\"\")","v":"San Domenico RC"},{"$f":"IFERROR(VLOOKUP(B87,INDIRECT(\"'\"&$K$1&\"'!\"&\"$C$2:$H$200\"),3,FALSE),\"\")","v":"M"},{"$f":"IFERROR(VLOOKUP(B87,INDIRECT(\"'\"&$K$1&\"'!\"&\"$C$2:$H$200\"),4,FALSE),\"\")","v":"MO40"},{"$f":"SUM(LARGE((H87,J87,L87,N87,P87),{1,2,3,4,5}))","v":76.93726937269372},"",0,"",0,2.3159722222222223,76.93726937269372,"",0,"",0,"",1,76.93726937269372]
[86,"Elio Lepore",{"$f":"IFERROR(VLOOKUP(B88,INDIRECT(\"'\"&$K$1&\"'!\"&\"$C$2:$H$200\"),2,FALSE),\"\")","v":"Les Croupiers RC"},{"$f":"IFERROR(VLOOKUP(B88,INDIRECT(\"'\"&$K$1&\"'!\"&\"$C$2:$H$200\"),3,FALSE),\"\")","v":"M"},{"$f":"IFERROR(VLOOKUP(B88,INDIRECT(\"'\"&$K$1&\"'!\"&\"$C$2:$H$200\"),4,FALSE),\"\")","v":"MO60"},{"$f":"SUM(LARGE((H88,J88,L88,N88,P88),{1,2,3,4,5}))","v":76.014760147601464},"",0,"",0,2.3333333333333335,76.014760147601464,"",0,"",0,"",1,76.014760147601464]
[87,"Peter Havard",{"$f":"IFERROR(VLOOKUP(B89,INDIRECT(\"'\"&$M$1&\"'!\"&\"$C$2:$H$400\"),2,FALSE),\"\")","v":"MDC"},{"$f":"IFERROR(VLOOKUP(B89,INDIRECT(\"'\"&$M$1&\"'!\"&\"$C$2:$H$400\"),3,FALSE),\"\")","v":"M"},{"$f":"IFERROR(VLOOKUP(B89,INDIRECT(\"'\"&$M$1&\"'!\"&\"$C$2:$H$400\"),4,FALSE),\"\")","v":"MO60"},{"$f":"SUM(LARGE((H89,J89,L89,N89,P89),{1,2,3,4,5}))","v":75.824087473870392},"",0,"",0,"",0,3.5752314814814813E-2,75.824087473870392,"",0,"",1,75.824087473870392]
[88,"Paul Chester",{"$f":"IFERROR(VLOOKUP(B90,INDIRECT(\"'\"&$K$1&\"'!\"&\"$C$2:$H$200\"),2,FALSE),\"\")","v":"WFRA"},{"$f":"IFERROR(VLOOKUP(B90,INDIRECT(\"'\"&$K$1&\"'!\"&\"$C$2:$H$200\"),3,FALSE),\"\")","v":"M"},{"$f":"IFERROR(VLOOKUP(B90,INDIRECT(\"'\"&$K$1&\"'!\"&\"$C$2:$H$200\"),4,FALSE),\"\")","v":"MO40"},{"$f":"SUM(LARGE((H90,J90,L90,N90,P90),{1,2,3,4,5}))","v":75.682656826568277},"",0,"",0,2.3395833333333331,75.682656826568277,"",0,"",0,"",1,75.682656826568277]
[89,"Darren Jones","Cardiff Harlequins","M","MU40",{"$f":"SUM(LARGE((H91,J91,L91,N91,P91),{1,2,3,4,5}))","v":75.129151291512926},"",0,"",0,2.35,75.129151291512926,"",0,"",0,"",1,75.129151291512926]
[90,"Liam Osborne","Pontypridd Roadents","M","MU40",{"$f":"SUM(LARGE((H92,J92,L92,N92,P92),{1,2,3,4,5}))","v":74.206642066420642},"",0,"",0,2.3673611111111112,74.206642066420642,"",0,"",0,"",1,74.206642066420642]
[91,"Niki Morgan","Chepstow Harriers","F","FO40",{"$f":"SUM(LARGE((H93,J93,L93,N93,P93),{1,2,3,4,5}))","v":73.911439114391129},"",0,"",0,2.3729166666666668,73.911439114391129,"",0,"",0,"",1,73.911439114391129]
[92,"Mark Durkin","Penarth & Dinas Runners","M","MU40",{"$f":"SUM(LARGE((H94,J94,L94,N94,P94),{1,2,3,4,5}))","v":73.837638376383779},"",0,"",0,2.3743055555555554,73.837638376383779,"",0,"",0,"",1,73.837638376383779]
[93,"Andrew Evans","Unattached","M","MO40",{"$f":"SUM(LARGE((H95,J95,L95,N95,P95),{1,2,3,4,5}))","v":73.763837638376373},"",0,"",0,2.3756944444444446,73.763837638376373,"",0,"",0,"",1,73.763837638376373]
[94,"Fraser Stephens",{"$f":"IFERROR(VLOOKUP(B96,INDIRECT(\"'\"&$M$1&\"'!\"&\"$C$2:$H$400\"),2,FALSE),\"\")","v":"SWOC"},{"$f":"IFERROR(VLOOKUP(B96,INDIRECT(\"'\"&$M$1&\"'!\"&\"$C$2:$H$400\"),3,FALSE),\"\")","v":"M"},{"$f":"IFERROR(VLOOKUP(B96,INDIRECT(\"'\"&$M$1&\"'!\"&\"$C$2:$H$400\"),4,FALSE),\"\")","v":"MO40"},{"$f":"SUM(LARGE((H96,J96,L96,N96,P96),{1,2,3,4,5}))","v":73.61312108055958},"",0,"",0,"",0,3.6388888888888887E-2,73.61312108055958,"",0,"",1,73.61312108055958]
[95,"Lee McMeeking",{"$f":"IFERROR(VLOOKUP(B97,INDIRECT(\"'\"&$K$1&\"'!\"&\"$C$2:$H$200\"),2,FALSE),\"\")","v":"Unattached"},{"$f":"IFERROR(VLOOKUP(B97,INDIRECT(\"'\"&$K$1&\"'!\"&\"$C$2:$H$200\"),3,FALSE),\"\")","v":"M"},{"$f":"IFERROR(VLOOKUP(B97,INDIRECT(\"'\"&$K$1&\"'!\"&\"$C$2:$H$200\"),4,FALSE),\"\")","v":"MO40"},{"$f":"SUM(LARGE((H97,J97,L97,N97,P97),{1,2,3,4,5}))","v":73.210332103321036},"",0,"",0,2.3861111111111111,73.210332103321036,"",0,"",0,"",1,73.210332103321036]
[96,"Ian Ogilvie",{"$f":"IFERROR(VLOOKUP(B98,INDIRECT(\"'\"&$K$1&\"'!\"&\"$C$2:$H$200\"),2,FALSE),\"\")","v":"Brackla Harriers"},{"$f":"IFERROR(VLOOKUP(B98,INDIRECT(\"'\"&$K$1&\"'!\"&\"$C$2:$H$200\"),3,FALSE),\"\")","v":"M"},{"$f":"IFERROR(VLOOKUP(B98,INDIRECT(\"'\"&$K$1&\"'!\"&\"$C$2:$H$200\"),4,FALSE),\"\")","v":"MO40"},{"$f":"SUM(LARGE((H98,J98,L98,N98,P98),{1,2,3,4,5}))","v":72.693726937269361},"",0,"",0,2.3958333333333335,72.693726937269361,"",0,"",0,"",1,72.693726937269361]
[97,"Richard Jones",{"$f":"IFERROR(VLOOKUP(B99,INDIRECT(\"'\"&$K$1&\"'!\"&\"$C$2:$H$200\"),2,FALSE),\"\")","v":"Unattached"},{"$f":"IFERROR(VLOOKUP(B99,INDIRECT(\"'\"&$K$1&\"'!\"&\"$C$2:$H$200\"),3,FALSE),\"\")","v":"M"},{"$f":"IFERROR(VLOOKUP(B99,INDIRECT(\"'\"&$K$1&\"'!\"&\"$C$2:$H$200\"),4,FALSE),\"\")","v":"MU40"},{"$f":"SUM(LARGE((H99,J99,L99,N99,P99),{1,2,3,4,5}))","v":72.546125461254604},"",0,"",0,2.3986111111111112,72.546125461254604,"",0,"",0,"",1,72.546125461254604]
[98,"David Morris",{"$f":"IFERROR(VLOOKUP(B100,INDIRECT(\"'\"&$K$1&\"'!\"&\"$C$2:$H$200\"),2,FALSE),\"\")","v":"Unattached"},{"$f":"IFERROR(VLOOKUP(B100,INDIRECT(\"'\"&$K$1&\"'!\"&\"$C$2:$H$200\"),3,FALSE),\"\")","v":"M"},{"$f":"IFERROR(VLOOKUP(B100,INDIRECT(\"'\"&$K$1&\"'!\"&\"$C$2:$H$200\"),4,FALSE),\"\")","v":"MU40"},{"$f":"SUM(LARGE((H100,J100,L100,N100,P100),{1,2,3,4,5}))","v":72.32472324723247},"",0,"",0,2.4027777777777777,72.32472324723247,"",0,"",0,"",1,72.32472324723247]
[99,"Laura Tinwell",{"$f":"IFERROR(VLOOKUP(B101,INDIRECT(\"'\"&$K$1&\"'!\"&\"$C$2:$H$200\"),2,FALSE),\"\")","v":"Pontypridd Roadents"},{"$f":"IFERROR(VLOOKUP(B101,INDIRECT(\"'\"&$K$1&\"'!\"&\"$C$2:$H$200\"),3,FALSE),\"\")","v":"F"},{"$f":"IFERROR(VLOOKUP(B101,INDIRECT(\"'\"&$K$1&\"'!\"&\"$C$2:$H$200\"),4,FALSE),\"\")","v":"FU40"},{"$f":"SUM(LARGE((H101,J101,L101,N101,P101),{1,2,3,4,5}))","v":72.177121771217713},"",0,"",0,2.4055555555555554,72.177121771217713,"",0,"",0,"",1,72.177121771217713]
[100,"Gary Gunner",{"$f":"IFERROR(VLOOKUP(B102,INDIRECT(\"'\"&$G$1&\"'!\"&\"$C$2:$H$200\"),2,FALSE),\"\")","v":"Croft Ambrey"},{"$f":"IFERROR(VLOOKUP(B102,INDIRECT(\"'\"&$G$1&\"'!\"&\"$C$2:$H$200\"),3,FALSE),\"\")","v":"M"},{"$f":"IFERROR(VLOOKUP(B102,INDIRECT(\"'\"&$G$1&\"'!\"&\"$C$2:$H$200\"),4,FALSE),\"\")","v":"M070"},{"$f":"SUM(LARGE((H102,J102,L102,N102,P102),{1,2,3,4,5}))","v":72.152986678126354},"00:19:50",72.152986678126354,"",0,"",0,"",0,"",0,"",1,72.152986678126354]
[101,"Glyn Sansom",{"$f":"IFERROR(VLOOKUP(B103,INDIRECT(\"'\"&$K$1&\"'!\"&\"$C$2:$H$200\"),2,FALSE),\"\")","v":"San Domenico RC"},{"$f":"IFERROR(VLOOKUP(B103,INDIRECT(\"'\"&$K$1&\"'!\"&\"$C$2:$H$200\"),3,FALSE),\"\")","v":"M"},{"$f":"IFERROR(VLOOKUP(B103,INDIRECT(\"'\"&$K$1&\"'!\"&\"$C$2:$H$200\"),4,FALSE),\"\")","v":"MO50"},{"$f":"SUM(LARGE((H103,J103,L103,N103,P103),{1,2,3,4,5}))","v":71.808118081180822},"",0,"",0,2.4125000000000001,71.808118081180822,"",0,"",0,"",1,71.808118081180822]
[102,"Geraint Jenkins","Port Talbot Harriers","M","MO40",{"$f":"SUM(LARGE((H104,J104,L104,N104,P104),{1,2,3,4,5}))","v":71.586715867158674},"",0,"",0,2.4166666666666665,71.586715867158674,"",0,"",0,"",1,71.586715867158674]
[103,"Nick Denny","Pontypridd Roadents","M","MU40",{"$f":"SUM(LARGE((H105,J105,L105,N105,P105),{1,2,3,4,5}))","v":71.439114391143903},"",0,"",0,2.4194444444444447,71.439114391143903,"",0,"",0,"",1,71.439114391143903]
[104,"Alec Care","San Domenico RC","M","MU40",{"$f":"SUM(LARGE((H106,J106,L106,N106,P106),{1,2,3,4,5}))","v":70.553505535055322},"",0,"",0,2.4361111111111113,70.553505535055322,"",0,"",0,"",1,70.553505535055322]
[105,"Huw Pullen","Unattached","M","MU40",{"$f":"SUM(LARGE((H107,J107,L107,N107,P107),{1,2,3,4,5}))","v":70.479704797047972},"",0,"",0,2.4375,70.479704797047972,"",0,"",0,"",1,70.479704797047972]
[106,"David Beard","Unattached","M","MU40",{"$f":"SUM(LARGE((H108,J108,L108,N108,P108),{1,2,3,4,5}))","v":70.258302583025809},"",0,"",0,2.4416666666666669,70.258302583025809,"",0,"",0,"",1,70.258302583025809]
[107,"Neil Grant","Chepstow Harriers","M","MO60",{"$f":"SUM(LARGE((H109,J109,L109,N109,P109),{1,2,3,4,5}))","v":70.110701107011081},"",0,"",0,2.4444444444444442,70.110701107011081,"",0,"",0,"",1,70.110701107011081]
[108,"Paul Cahill",{"$f":"IFERROR(VLOOKUP(B110,INDIRECT(\"'\"&$M$1&\"'!\"&\"$C$2:$H$400\"),2,FALSE),\"\")","v":"U/A"},{"$f":"IFERROR(VLOOKUP(B110,INDIRECT(\"'\"&$M$1&\"'!\"&\"$C$2:$H$400\"),3,FALSE),\"\")","v":"M"},{"$f":"IFERROR(VLOOKUP(B110,INDIRECT(\"'\"&$M$1&\"'!\"&\"$C$2:$H$400\"),4,FALSE),\"\")","v":"MU40"},{"$f":"SUM(LARGE((H110,J110,L110,N110,P110),{1,2,3,4,5}))","v":70.07557485126226},"",0,"",0,"",0,3.740740740740741E-2,70.07557485126226,"",0,"",1,70.07557485126226]
[109,"Carl Edwards",{"$f":"IFERROR(VLOOKUP(B111,INDIRECT(\"'\"&$K$1&\"'!\"&\"$C$2:$H$200\"),2,FALSE),\"\")","v":"Pontypridd Roadents"},{"$f":"IFERROR(VLOOKUP(B111,INDIRECT(\"'\"&$K$1&\"'!\"&\"$C$2:$H$200\"),3,FALSE),\"\")","v":"M"},{"$f":"IFERROR(VLOOKUP(B111,INDIRECT(\"'\"&$K$1&\"'!\"&\"$C$2:$H$200\"),4,FALSE),\"\")","v":"MO40"},{"$f":"SUM(LARGE((H111,J111,L111,N111,P111),{1,2,3,4,5}))","v":69.815498154981555},"",0,"",0,2.4499999999999997,69.815498154981555,"",0,"",0,"",1,69.815498154981555]
[110,"Matthew Hooper","Les Croupiers RC","M","MU40",{"$f":"SUM(LARGE((H112,J112,L112,N112,P112),{1,2,3,4,5}))","v":69.741697416974176},"",0,"",0,2.4513888888888888,69.741697416974176,"",0,"",0,"",1,69.741697416974176]
[111,"Natalie Taylor","Mynydd Du","F","FU40",{"$f":"SUM(LARGE((H113,J113,L113,N113,P113),{1,2,3,4,5}))","v":69.667896678966784},"",0,"",0,2.4527777777777779,69.667896678966784,"",0,"",0,"",1,69.667896678966784]
[112,"Sean McNally","Unattached","M","MU40",{"$f":"SUM(LARGE((H114,J114,L114,N114,P114),{1,2,3,4,5}))","v":69.557195571955717},"",0,"",0,2.4548611111111112,69.557195571955717,"",0,"",0,"",1,69.557195571955717]
[113,"Elaine Ferguson","Pontypridd Roadents","F","FU40",{"$f":"SUM(LARGE((H115,J115,L115,N115,P115),{1,2,3,4,5}))","v":69.446494464944635},"",0,"",0,2.4569444444444444,69.446494464944635,"",0,"",0,"",1,69.446494464944635]
[114,"Jamie Bishop","Pontypridd Roadents","M","MU40",{"$f":"SUM(LARGE((H116,J116,L116,N116,P116),{1,2,3,4,5}))","v":69.151291512915122},"",0,"",0,2.4624999999999999,69.151291512915122,"",0,"",0,"",1,69.151291512915122]
[115,"Simon Slinn","Unattached","M","MU40",{"$f":"SUM(LARGE((H117,J117,L117,N117,P117),{1,2,3,4,5}))","v":68.929889298892988},"",0,"",0,2.4666666666666668,68.929889298892988,"",0,"",0,"",1,68.929889298892988]
[116,"Rob McAllister","Unattached","M","MU40",{"$f":"SUM(LARGE((H118,J118,L118,N118,P118),{1,2,3,4,5}))","v":68.376383763837637},"",0,"",0,2.4770833333333333,68.376383763837637,"",0,"",0,"",1,68.376383763837637]
[117,"Nick Harris","Cwm Ogwr RC","M","MU40",{"$f":"SUM(LARGE((H119,J119,L119,N119,P119),{1,2,3,4,5}))","v":68.044280442804421},"",0,"",0,2.4833333333333334,68.044280442804421,"",0,"",0,"",1,68.044280442804421]
[118,"Robert Wilson","Penarth & Dinas Runners","M","MO50",{"$f":"SUM(LARGE((H120,J120,L120,N120,P120),{1,2,3,4,5}))","v":67.749077490774894},"",0,"",0,2.4888888888888889,67.749077490774894,"",0,"",0,"",1,67.749077490774894]
[119,"David Underhill","Unattached","M","MU40",{"$f":"SUM(LARGE((H121,J121,L121,N121,P121),{1,2,3,4,5}))","v":67.638376383763841},"",0,"",0,2.4909722222222221,67.638376383763841,"",0,"",0,"",1,67.638376383763841]
[120,"David Harden","Unattached","M","MU40",{"$f":"SUM(LARGE((H122,J122,L122,N122,P122),{1,2,3,4,5}))","v":67.343173431734328},"",0,"",0,2.4965277777777777,67.343173431734328,"",0,"",0,"",1,67.343173431734328]
[121,"Matthew Lynch","Unattached","M","MO40",{"$f":"SUM(LARGE((H123,J123,L123,N123,P123),{1,2,3,4,5}))","v":66.974169741697409},"",0,"",0,2.5034722222222223,66.974169741697409,"",0,"",0,"",1,66.974169741697409]
[122,"Sasha Habgood",{"$f":"IFERROR(VLOOKUP(B124,INDIRECT(\"'\"&$G$1&\"'!\"&\"$C$2:$H$200\"),2,FALSE),\"\")","v":"MDC"},{"$f":"IFERROR(VLOOKUP(B124,INDIRECT(\"'\"&$G$1&\"'!\"&\"$C$2:$H$200\"),3,FALSE),\"\")","v":"F"},{"$f":"IFERROR(VLOOKUP(B124,INDIRECT(\"'\"&$G$1&\"'!\"&\"$C$2:$H$200\"),4,FALSE),\"\")","v":"FO40"},{"$f":"SUM(LARGE((H124,J124,L124,N124,P124),{1,2,3,4,5}))","v":66.781263429308126},"00:20:40",66.781263429308126,"",0,"",0,"",0,"",0,"",1,66.781263429308126]
[123,"Nigel Graham",{"$f":"IFERROR(VLOOKUP(B125,INDIRECT(\"'\"&$K$1&\"'!\"&\"$C$2:$H$200\"),2,FALSE),\"\")","v":"Unattached"},{"$f":"IFERROR(VLOOKUP(B125,INDIRECT(\"'\"&$K$1&\"'!\"&\"$C$2:$H$200\"),3,FALSE),\"\")","v":"M"},{"$f":"IFERROR(VLOOKUP(B125,INDIRECT(\"'\"&$K$1&\"'!\"&\"$C$2:$H$200\"),4,FALSE),\"\")","v":"MO40"},{"$f":"SUM(LARGE((H125,J125,L125,N125,P125),{1,2,3,4,5}))","v":66.420664206642073},"",0,"",0,2.5138888888888888,66.420664206642073,"",0,"",0,"",1,66.420664206642073]
[124,"John Magee","Les Croupiers RC","M","MO40",{"$f":"SUM(LARGE((H126,J126,L126,N126,P126),{1,2,3,4,5}))","v":66.199261992619938},"",0,"",0,2.5180555555555553,66.199261992619938,"",0,"",0,"",1,66.199261992619938]
[125,"Howard Kent","Les Croupiers RC","M","MO60",{"$f":"SUM(LARGE((H127,J127,L127,N127,P127),{1,2,3,4,5}))","v":66.125461254612532},"",0,"",0,2.5194444444444444,66.125461254612532,"",0,"",0,"",1,66.125461254612532]
[126,"Paul Thomas","Islwyn RC","M","MO40",{"$f":"SUM(LARGE((H128,J128,L128,N128,P128),{1,2,3,4,5}))","v":65.977859778597775},"",0,"",0,2.5222222222222221,65.977859778597775,"",0,"",0,"",1,65.977859778597775]
[127,"Alice Bedwell","Mynyddwyr de Cymru","F","FO50",{"$f":"SUM(LARGE((H129,J129,L129,N129,P129),{1,2,3,4,5}))","v":65.608856088560884},"",0,"",0,2.5291666666666668,65.608856088560884,"",0,"",0,"",1,65.608856088560884]
[128,"Stephen May","Pontypridd Roadents","M","MO40",{"$f":"SUM(LARGE((H130,J130,L130,N130,P130),{1,2,3,4,5}))","v":65.424354243542453},"",0,"",0,2.5326388888888887,65.424354243542453,"",0,"",0,"",1,65.424354243542453]
[{"$f":"ROW(A129)","v":129},"Kerry Galey","Unattached","M","MO50",{"$f":"SUM(LARGE((H131,J131,L131,N131,P131),{1,2,3,4,5}))","v":65.350553505535046},{"$f":"IFERROR(VLOOKUP(B131,INDIRECT(\"'\"&$G$1&\"'!\"&\"$C$2:$H$200\"),5,FALSE),\"\")","v":""},{"$f":"IFERROR(VLOOKUP(B131,INDIRECT(\"'\"&$G$1&\"'!\"&\"$C$2:$H$200\"),6,FALSE),0)","v":0},{"$f":"IFERROR(VLOOKUP(B131,INDIRECT(\"'\"&$I$1&\"'!\"&\"$C$2:$G$200\"),5,FALSE),\"\")","v":""},{"$f":"IFERROR(VLOOKUP(B131,INDIRECT(\"'\"&$I$1&\"'!\"&\"$C$2:$H$200\"),6,FALSE),0)","v":0},{"$f":"IFERROR(VLOOKUP(B131,INDIRECT(\"'\"&$K$1&\"'!\"&\"$C$2:$G$400\"),5,FALSE),\"\")","v":2.5340277777777778},{"$f":"IFERROR(VLOOKUP(B131,INDIRECT(\"'\"&$K$1&\"'!\"&\"$C$2:$H$400\"),6,FALSE),0)","v":65.350553505535046},{"$f":"IFERROR(VLOOKUP(B131,INDIRECT(\"'\"&$M$1&\"'!\"&\"$C$2:$H$200\"),5,FALSE),\"\")","v":""},{"$f":"IFERROR(VLOOKUP(B131,INDIRECT(\"'\"&$M$1&\"'!\"&\"$C$2:$H$200\"),6,FALSE),0)","v":0},{"$f":"IFERROR(VLOOKUP(B131,INDIRECT(\"'\"&$O$1&\"'!\"&\"$C$2:$G$200\"),4,FALSE),\"\")","v":""},{"$f":"IFERROR(VLOOKUP(B131,INDIRECT(\"'\"&$O$1&\"'!\"&\"$C$2:$G$200\"),5,FALSE),0)","v":0},{"$f":"IFERROR(VLOOKUP(B131,INDIRECT(\"'\"&$Q$1&\"'!\"&\"$C$2:$G$200\"),4,FALSE),\"\")","v":""},{"$f":"6-COUNTIF(G131:Q131,\"\")","v":1},{"$f":"F131/IF(R131>4,5,R131)","v":65.350553505535046}]
[130,"Stephen Owen","Chepstow Harriers","M","MO60",{"$f":"SUM(LARGE((H132,J132,L132,N132,P132),{1,2,3,4,5}))","v":65.166051660516587},"",0,"",0,2.5375000000000001,65.166051660516587,"",0,"",0,"",1,65.166051660516587]
[131,"Nick Young","Cardiff Tri","M","MU40",{"$f":"SUM(LARGE((H133,J133,L133,N133,P133),{1,2,3,4,5}))","v":65.01845018450183},"",0,"",0,2.5402777777777779,65.01845018450183,"",0,"",0,"",1,65.01845018450183]
[132,"Hefin Gruffydd","Pontypridd Roadents","M","MO50",{"$f":"SUM(LARGE((H134,J134,L134,N134,P134),{1,2,3,4,5}))","v":64.981549815498155},"",0,"",0,2.5409722222222224,64.981549815498155,"",0,"",0,"",1,64.981549815498155]
[133,"Richard Howells","Unattached","M","MU40",{"$f":"SUM(LARGE((H135,J135,L135,N135,P135),{1,2,3,4,5}))","v":64.981549815498155},"",0,"",0,2.5409722222222224,64.981549815498155,"",0,"",0,"",1,64.981549815498155]
[134,"Richard D Jones","Unattached","M","MO40",{"$f":"SUM(LARGE((H136,J136,L136,N136,P136),{1,2,3,4,5}))","v":64.944649446494481},"",0,"",0,2.5416666666666665,64.944649446494481,"",0,"",0,"",1,64.944649446494481]
[135,"Craig Smith","Pegasus RC","M","MU40",{"$f":"SUM(LARGE((H137,J137,L137,N137,P137),{1,2,3,4,5}))","v":64.61254612546125},"",0,"",0,2.5479166666666666,64.61254612546125,"",0,"",0,"",1,64.61254612546125]
[136,"Cath Tailby","Penarth & Dinas Runners","F","FO40",{"$f":"SUM(LARGE((H138,J138,L138,N138,P138),{1,2,3,4,5}))","v":64.391143911439102},"",0,"",0,2.5520833333333335,64.391143911439102,"",0,"",0,"",1,64.391143911439102]
[137,"Peter Llewellyn","Unattached","M","MU40",{"$f":"SUM(LARGE((H139,J139,L139,N139,P139),{1,2,3,4,5}))","v":64.206642066420642},"",0,"",0,2.5555555555555558,64.206642066420642,"",0,"",0,"",1,64.206642066420642]
[138,"Gareth Jones","Mynyddwyr de Cymru","M","MO60",{"$f":"SUM(LARGE((H140,J140,L140,N140,P140),{1,2,3,4,5}))","v":64.0590405904059},"",0,"",0,2.5583333333333331,64.0590405904059,"",0,"",0,"",1,64.0590405904059]
[139,"Harry Row","Unattached","M","MU40",{"$f":"SUM(LARGE((H141,J141,L141,N141,P141),{1,2,3,4,5}))","v":63.911439114391122},"",0,"",0,2.5611111111111113,63.911439114391122,"",0,"",0,"",1,63.911439114391122]
[140,"Rhys Griffiths","Hendre Lake RC","M","MU40",{"$f":"SUM(LARGE((H142,J142,L142,N142,P142),{1,2,3,4,5}))","v":63.874538745387468},"",0,"",0,2.5618055555555554,63.874538745387468,"",0,"",0,"",1,63.874538745387468]
[141,"Patrick Keating","Unattached","M","MU40",{"$f":"SUM(LARGE((H143,J143,L143,N143,P143),{1,2,3,4,5}))","v":63.763837638376387},"",0,"",0,2.5638888888888887,63.763837638376387,"",0,"",0,"",1,63.763837638376387]
[142,"Paul Harvey","Pontypool","M","MU40",{"$f":"SUM(LARGE((H144,J144,L144,N144,P144),{1,2,3,4,5}))","v":63.726937269372705},"",0,"",0,2.5645833333333332,63.726937269372705,"",0,"",0,"",1,63.726937269372705]
[143,"Ian Leaves","Unattached","M","MO40",{"$f":"SUM(LARGE((H145,J145,L145,N145,P145),{1,2,3,4,5}))","v":63.616236162361602},"",0,"",0,2.5666666666666669,63.616236162361602,"",0,"",0,"",1,63.616236162361602]
[144,"Sally Lock","Unattached","F","FU40",{"$f":"SUM(LARGE((H146,J146,L146,N146,P146),{1,2,3,4,5}))","v":63.247232472324733},"",0,"",0,2.5736111111111111,63.247232472324733,"",0,"",0,"",1,63.247232472324733]
[145,"Glenn Powell","Penarth & Dinas Runners","M","MU40",{"$f":"SUM(LARGE((H147,J147,L147,N147,P147),{1,2,3,4,5}))","v":62.435424354243537},"",0,"",0,2.588888888888889,62.435424354243537,"",0,"",0,"",1,62.435424354243537]
[146,"David Cornish","Port Talbot Harriers","M","MO50",{"$f":"SUM(LARGE((H148,J148,L148,N148,P148),{1,2,3,4,5}))","v":61.54981549815497},"",0,"",0,2.6055555555555556,61.54981549815497,"",0,"",0,"",1,61.54981549815497]
[147,"Gina Hardman","Bridgend AC","F","FO40",{"$f":"SUM(LARGE((H149,J149,L149,N149,P149),{1,2,3,4,5}))","v":61.291512915129154},"",0,"",0,2.6104166666666666,61.291512915129154,"",0,"",0,"",1,61.291512915129154]
[148,"Jan Edwards","Pontypridd Roadents","F","FO40",{"$f":"SUM(LARGE((H150,J150,L150,N150,P150),{1,2,3,4,5}))","v":61.033210332103337},"",0,"",0,2.6152777777777776,61.033210332103337,"",0,"",0,"",1,61.033210332103337]
[149,"Richard Bowie","Fairwater Runners","M","MO50",{"$f":"SUM(LARGE((H151,J151,L151,N151,P151),{1,2,3,4,5}))","v":60.738007380073796},"",0,"",0,2.6208333333333331,60.738007380073796,"",0,"",0,"",1,60.738007380073796]
[150,"John Kerley","AS Chamonix","M","MO60",{"$f":"SUM(LARGE((H152,J152,L152,N152,P152),{1,2,3,4,5}))","v":60.516605166051662},"",0,"",0,2.625,60.516605166051662,"",0,"",0,"",1,60.516605166051662]
[151,"Jessica Ellis","Les Croupiers RC","F","FU40",{"$f":"SUM(LARGE((H153,J153,L153,N153,P153),{1,2,3,4,5}))","v":60.479704797047958},"",0,"",0,2.6256944444444446,60.479704797047958,"",0,"",0,"",1,60.479704797047958]
[152,"Robert Haley","Unattached","M","MU40",{"$f":"SUM(LARGE((H154,J154,L154,N154,P154),{1,2,3,4,5}))","v":60.369003690036905},"",0,"",0,2.6277777777777778,60.369003690036905,"",0,"",0,"",1,60.369003690036905]
[153,"Pat Westlake","Unattached","M","MO50",{"$f":"SUM(LARGE((H155,J155,L155,N155,P155),{1,2,3,4,5}))","v":60.295202952029506},"",0,"",0,2.6291666666666669,60.295202952029506,"",0,"",0,"",1,60.295202952029506]
[154,"Jeremy Theobald","Cardiff Tri","M","MU40",{"$f":"SUM(LARGE((H156,J156,L156,N156,P156),{1,2,3,4,5}))","v":59.926199261992629},"",0,"",0,2.6361111111111111,59.926199261992629,"",0,"",0,"",1,59.926199261992629]
[155,"Anna Lewis","Unattached","F","FU40",{"$f":"SUM(LARGE((H157,J157,L157,N157,P157),{1,2,3,4,5}))","v":59.557195571955731},"",0,"",0,2.6430555555555553,59.557195571955731,"",0,"",0,"",1,59.557195571955731]
[156,"Ian Bell","San Domenico RC","M","MO50",{"$f":"SUM(LARGE((H158,J158,L158,N158,P158),{1,2,3,4,5}))","v":59.040590405904055},"",0,"",0,2.6527777777777777,59.040590405904055,"",0,"",0,"",1,59.040590405904055]
[157,"Paul Gilsen","Unattached","M","MU40",{"$f":"SUM(LARGE((H159,J159,L159,N159,P159),{1,2,3,4,5}))","v":58.634686346863461},"",0,"",0,2.6604166666666669,58.634686346863461,"",0,"",0,"",1,58.634686346863461]
[158,"Jeanette Jenkins","Fairwater Runners","F","FO50",{"$f":"SUM(LARGE((H160,J160,L160,N160,P160),{1,2,3,4,5}))","v":58.523985239852379},"",0,"",0,2.6625000000000001,58.523985239852379,"",0,"",0,"",1,58.523985239852379]
[159,"Roy Silver","Les Croupiers RC","M","MO50",{"$f":"SUM(LARGE((H161,J161,L161,N161,P161),{1,2,3,4,5}))","v":58.339483394833948},"",0,"",0,2.6659722222222224,58.339483394833948,"",0,"",0,"",1,58.339483394833948]
[160,"Martin Slucutt","Swansea Harriers","M","MU40",{"$f":"SUM(LARGE((H162,J162,L162,N162,P162),{1,2,3,4,5}))","v":58.007380073800732},"",0,"",0,2.6722222222222225,58.007380073800732,"",0,"",0,"",1,58.007380073800732]
[161,"John Carroll","Roberttown Runners","M","MO50",{"$f":"SUM(LARGE((H163,J163,L163,N163,P163),{1,2,3,4,5}))","v":57.970479704797029},"",0,"",0,2.6729166666666671,57.970479704797029,"",0,"",0,"",1,57.970479704797029]
[162,"Liz Merrifield","Unattached","F","FU40",{"$f":"SUM(LARGE((H164,J164,L164,N164,P164),{1,2,3,4,5}))","v":57.933579335793354},"",0,"",0,2.6736111111111112,57.933579335793354,"",0,"",0,"",1,57.933579335793354]
[163,"Judith Oakley","Vegan Runners","F","FO50",{"$f":"SUM(LARGE((H165,J165,L165,N165,P165),{1,2,3,4,5}))","v":57.859778597785969},"",0,"",0,2.6750000000000003,57.859778597785969,"",0,"",0,"",1,57.859778597785969]
[164,"Ruth Deards","Les Croupiers RC","F","FO40",{"$f":"SUM(LARGE((H166,J166,L166,N166,P166),{1,2,3,4,5}))","v":57.12177121771218},"",0,"",0,2.6888888888888887,57.12177121771218,"",0,"",0,"",1,57.12177121771218]
[165,"Martin Gebbett","Horstorth Fellindale","M","MO50",{"$f":"SUM(LARGE((H167,J167,L167,N167,P167),{1,2,3,4,5}))","v":56.863468634686342},"",0,"",0,2.6937500000000001,56.863468634686342,"",0,"",0,"",1,56.863468634686342]
[166,"Jan Richards",{"$f":"IFERROR(VLOOKUP(B168,INDIRECT(\"'\"&$M$1&\"'!\"&\"$C$2:$H$400\"),2,FALSE),\"\")","v":"Mynydd Du"},{"$f":"IFERROR(VLOOKUP(B168,INDIRECT(\"'\"&$M$1&\"'!\"&\"$C$2:$H$400\"),3,FALSE),\"\")","v":"F"},{"$f":"IFERROR(VLOOKUP(B168,INDIRECT(\"'\"&$M$1&\"'!\"&\"$C$2:$H$400\"),4,FALSE),\"\")","v":"FO50"},{"$f":"SUM(LARGE((H168,J168,L168,N168,P168),{1,2,3,4,5}))","v":56.689178324489497},"",0,"",0,"",0,4.1261574074074069E-2,56.689178324489497,"",0,"",1,56.689178324489497]
[167,"Linda Woodland",{"$f":"IFERROR(VLOOKUP(B169,INDIRECT(\"'\"&$K$1&\"'!\"&\"$C$2:$H$200\"),2,FALSE),\"\")","v":"Port Talbot Harriers"},{"$f":"IFERROR(VLOOKUP(B169,INDIRECT(\"'\"&$K$1&\"'!\"&\"$C$2:$H$200\"),3,FALSE),\"\")","v":"F"},{"$f":"IFERROR(VLOOKUP(B169,INDIRECT(\"'\"&$K$1&\"'!\"&\"$C$2:$H$200\"),4,FALSE),\"\")","v":"FO50"},{"$f":"SUM(LARGE((H169,J169,L169,N169,P169),{1,2,3,4,5}))","v":56.678966789667882},"",0,"",0,2.6972222222222224,56.678966789667882,"",0,"",0,"",1,56.678966789667882]
[168,"Glyn Drucker",{"$f":"IFERROR(VLOOKUP(B170,INDIRECT(\"'\"&$K$1&\"'!\"&\"$C$2:$H$200\"),2,FALSE),\"\")","v":"Caerphilly Runners"},{"$f":"IFERROR(VLOOKUP(B170,INDIRECT(\"'\"&$K$1&\"'!\"&\"$C$2:$H$200\"),3,FALSE),\"\")","v":"M"},{"$f":"IFERROR(VLOOKUP(B170,INDIRECT(\"'\"&$K$1&\"'!\"&\"$C$2:$H$200\"),4,FALSE),\"\")","v":"MO40"},{"$f":"SUM(LARGE((H170,J170,L170,N170,P170),{1,2,3,4,5}))","v":56.236162361623613},"",0,"",0,2.7055555555555557,56.236162361623613,"",0,"",0,"",1,56.236162361623613]
[169,"Dewi Gwynedd",{"$f":"IFERROR(VLOOKUP(B171,INDIRECT(\"'\"&$K$1&\"'!\"&\"$C$2:$H$200\"),2,FALSE),\"\")","v":"Unattached"},{"$f":"IFERROR(VLOOKUP(B171,INDIRECT(\"'\"&$K$1&\"'!\"&\"$C$2:$H$200\"),3,FALSE),\"\")","v":"M"},{"$f":"IFERROR(VLOOKUP(B171,INDIRECT(\"'\"&$K$1&\"'!\"&\"$C$2:$H$200\"),4,FALSE),\"\")","v":"MO40"},{"$f":"SUM(LARGE((H171,J171,L171,N171,P171),{1,2,3,4,5}))","v":56.162361623616228},"",0,"",0,2.7069444444444444,56.162361623616228,"",0,"",0,"",1,56.162361623616228]
[170,"Kat Hunter",{"$f":"IFERROR(VLOOKUP(B172,INDIRECT(\"'\"&$K$1&\"'!\"&\"$C$2:$H$200\"),2,FALSE),\"\")","v":"Unattached"},{"$f":"IFERROR(VLOOKUP(B172,INDIRECT(\"'\"&$K$1&\"'!\"&\"$C$2:$H$200\"),3,FALSE),\"\")","v":"F"},{"$f":"IFERROR(VLOOKUP(B172,INDIRECT(\"'\"&$K$1&\"'!\"&\"$C$2:$H$200\"),4,FALSE),\"\")","v":"FU40"},{"$f":"SUM(LARGE((H172,J172,L172,N172,P172),{1,2,3,4,5}))","v":55.793357933579337},"",0,"",0,2.713888888888889,55.793357933579337,"",0,"",0,"",1,55.793357933579337]
[171,"Dave Mathews",{"$f":"IFERROR(VLOOKUP(B173,INDIRECT(\"'\"&$K$1&\"'!\"&\"$C$2:$H$200\"),2,FALSE),\"\")","v":"Penarth & Dinas Runners"},{"$f":"IFERROR(VLOOKUP(B173,INDIRECT(\"'\"&$K$1&\"'!\"&\"$C$2:$H$200\"),3,FALSE),\"\")","v":"M"},{"$f":"IFERROR(VLOOKUP(B173,INDIRECT(\"'\"&$K$1&\"'!\"&\"$C$2:$H$200\"),4,FALSE),\"\")","v":"MU40"},{"$f":"SUM(LARGE((H173,J173,L173,N173,P173),{1,2,3,4,5}))","v":55.461254612546142},"",0,"",0,2.7201388888888887,55.461254612546142,"",0,"",0,"",1,55.461254612546142]
[172,"Gemma O'Brien",{"$f":"IFERROR(VLOOKUP(B174,INDIRECT(\"'\"&$M$1&\"'!\"&\"$C$2:$H$400\"),2,FALSE),\"\")","v":"U/A"},{"$f":"IFERROR(VLOOKUP(B174,INDIRECT(\"'\"&$M$1&\"'!\"&\"$C$2:$H$400\"),3,FALSE),\"\")","v":"F"},{"$f":"IFERROR(VLOOKUP(B174,INDIRECT(\"'\"&$M$1&\"'!\"&\"$C$2:$H$400\"),4,FALSE),\"\")","v":"FU40"},{"$f":"SUM(LARGE((H174,J174,L174,N174,P174),{1,2,3,4,5}))","v":55.362598488502982},"",0,"",0,"",0,4.1643518518518517E-2,55.362598488502982,"",0,"",1,55.362598488502982]
[173,"Kevin Hale",{"$f":"IFERROR(VLOOKUP(B175,INDIRECT(\"'\"&$M$1&\"'!\"&\"$C$2:$H$400\"),2,FALSE),\"\")","v":"Bridgend AC"},{"$f":"IFERROR(VLOOKUP(B175,INDIRECT(\"'\"&$M$1&\"'!\"&\"$C$2:$H$400\"),3,FALSE),\"\")","v":"M"},{"$f":"IFERROR(VLOOKUP(B175,INDIRECT(\"'\"&$M$1&\"'!\"&\"$C$2:$H$400\"),4,FALSE),\"\")","v":"MO50"},{"$f":"SUM(LARGE((H175,J175,L175,N175,P175),{1,2,3,4,5}))","v":55.362598488502982},"",0,"",0,"",0,4.1643518518518517E-2,55.362598488502982,"",0,"",1,55.362598488502982]
[174,"Bob Ford",{"$f":"IFERROR(VLOOKUP(B176,INDIRECT(\"'\"&$K$1&\"'!\"&\"$C$2:$H$200\"),2,FALSE),\"\")","v":"Pontypridd Roadents"},{"$f":"IFERROR(VLOOKUP(B176,INDIRECT(\"'\"&$K$1&\"'!\"&\"$C$2:$H$200\"),3,FALSE),\"\")","v":"M"},{"$f":"IFERROR(VLOOKUP(B176,INDIRECT(\"'\"&$K$1&\"'!\"&\"$C$2:$H$200\"),4,FALSE),\"\")","v":"MO60"},{"$f":"SUM(LARGE((H176,J176,L176,N176,P176),{1,2,3,4,5}))","v":55.313653136531386},"",0,"",0,2.7229166666666664,55.313653136531386,"",0,"",0,"",1,55.313653136531386]
[175,"Jonathan Morris","Unattached","M","MU40",{"$f":"SUM(LARGE((H177,J177,L177,N177,P177),{1,2,3,4,5}))","v":55.092250922509223},"",0,"",0,2.7270833333333333,55.092250922509223,"",0,"",0,"",1,55.092250922509223]
[176,"Kris Powell","Unattached","F","FU40",{"$f":"SUM(LARGE((H178,J178,L178,N178,P178),{1,2,3,4,5}))","v":54.870848708487109},"",0,"",0,2.7312499999999997,54.870848708487109,"",0,"",0,"",1,54.870848708487109]
[177,"Nicholas Pounder","Pontypridd Roadents","M","MO40",{"$f":"SUM(LARGE((H179,J179,L179,N179,P179),{1,2,3,4,5}))","v":54.538745387453872},"",0,"",0,2.7375000000000003,54.538745387453872,"",0,"",0,"",1,54.538745387453872]
[178,"Aisling Pigott","Outdoor Fitness","F","FU40",{"$f":"SUM(LARGE((H180,J180,L180,N180,P180),{1,2,3,4,5}))","v":54.39114391143913},"",0,"",0,2.7402777777777776,54.39114391143913,"",0,"",0,"",1,54.39114391143913]
[179,"Neill Parker","Islwyn RC","M","MO40",{"$f":"SUM(LARGE((H181,J181,L181,N181,P181),{1,2,3,4,5}))","v":54.31734317343173},"",0,"",0,2.7416666666666667,54.31734317343173,"",0,"",0,"",1,54.31734317343173]
[180,"Martyn Jenkins","Fairwater Runners","M","MO50",{"$f":"SUM(LARGE((H182,J182,L182,N182,P182),{1,2,3,4,5}))","v":53.948339483394811},"",0,"",0,2.7486111111111113,53.948339483394811,"",0,"",0,"",1,53.948339483394811]
[181,"Adrian Gwilliam","Fairwater Runners","M","MO50",{"$f":"SUM(LARGE((H183,J183,L183,N183,P183),{1,2,3,4,5}))","v":53.726937269372698},"",0,"",0,2.7527777777777778,53.726937269372698,"",0,"",0,"",1,53.726937269372698]
[182,"Neil Coleman","Unattached","M","MO50",{"$f":"SUM(LARGE((H184,J184,L184,N184,P184),{1,2,3,4,5}))","v":52.988929889298866},"",0,"",0,2.7666666666666671,52.988929889298866,"",0,"",0,"",1,52.988929889298866]
[183,"Dean McNeil-Jones","Unattached","M","MO40",{"$f":"SUM(LARGE((H185,J185,L185,N185,P185),{1,2,3,4,5}))","v":52.509225092250929},"",0,"",0,2.775694444444444,52.509225092250929,"",0,"",0,"",1,52.509225092250929]
[184,"Andrew Ramsey","Caerphilly Runners","M","MU40",{"$f":"SUM(LARGE((H186,J186,L186,N186,P186),{1,2,3,4,5}))","v":52.324723247232477},"",0,"",0,2.7791666666666668,52.324723247232477,"",0,"",0,"",1,52.324723247232477]
[185,"Karen Hackwell","Unattached","F","FO40",{"$f":"SUM(LARGE((H187,J187,L187,N187,P187),{1,2,3,4,5}))","v":51.881918819188179},"",0,"",0,2.7875000000000001,51.881918819188179,"",0,"",0,"",1,51.881918819188179]
[186,"Lisa Cleary","Penarth & Dinas Runners","F","FO50",{"$f":"SUM(LARGE((H188,J188,L188,N188,P188),{1,2,3,4,5}))","v":50.959409594095952},"",0,"",0,2.8048611111111108,50.959409594095952,"",0,"",0,"",1,50.959409594095952]
[187,"Rachel Garside","Unattached","F","FO40",{"$f":"SUM(LARGE((H189,J189,L189,N189,P189),{1,2,3,4,5}))","v":50.885608856088574},"",0,"",0,2.8062499999999999,50.885608856088574,"",0,"",0,"",1,50.885608856088574]
[188,"Peter Dorrington","Unattached","M","MU40",{"$f":"SUM(LARGE((H190,J190,L190,N190,P190),{1,2,3,4,5}))","v":50.258302583025817},"",0,"",0,2.818055555555556,50.258302583025817,"",0,"",0,"",1,50.258302583025817]
[189,"Gwyn Jones","Les Croupiers RC","M","MO50",{"$f":"SUM(LARGE((H191,J191,L191,N191,P191),{1,2,3,4,5}))","v":50.221402214022135},"",0,"",0,2.8187500000000001,50.221402214022135,"",0,"",0,"",1,50.221402214022135]
[190,"Stephen Paskell","Pontyclun Road Runners","M","MO40",{"$f":"SUM(LARGE((H192,J192,L192,N192,P192),{1,2,3,4,5}))","v":50.221402214022135},"",0,"",0,2.8187500000000001,50.221402214022135,"",0,"",0,"",1,50.221402214022135]
[191,"Neil Cook","Unattached","M","MO40",{"$f":"SUM(LARGE((H193,J193,L193,N193,P193),{1,2,3,4,5}))","v":50.036900369003675},"",0,"",0,2.8222222222222224,50.036900369003675,"",0,"",0,"",1,50.036900369003675]
[192,"Andrew Palmer","Penarth & Dinas Runners","M","MO40",{"$f":"SUM(LARGE((H194,J194,L194,N194,P194),{1,2,3,4,5}))","v":50},"",0,"",0,2.8229166666666665,50,"",0,"",0,"",1,50]
[{"$f":"ROW(A193)","v":193},"Jon Griffiths","Village Vipers","M","MO40",{"$f":"SUM(LARGE((H195,J195,L195,N195,P195),{1,2,3,4,5}))","v":49.741697416974183},{"$f":"IFERROR(VLOOKUP(B195,INDIRECT(\"'\"&$G$1&\"'!\"&\"$C$2:$H$200\"),5,FALSE),\"\")","v":""},{"$f":"IFERROR(VLOOKUP(B195,INDIRECT(\"'\"&$G$1&\"'!\"&\"$C$2:$H$200\"),6,FALSE),0)","v":0},{"$f":"IFERROR(VLOOKUP(B195,INDIRECT(\"'\"&$I$1&\"'!\"&\"$C$2:$G$200\"),5,FALSE),\"\")","v":""},{"$f":"IFERROR(VLOOKUP(B195,INDIRECT(\"'\"&$I$1&\"'!\"&\"$C$2:$H$200\"),6,FALSE),0)","v":0},{"$f":"IFERROR(VLOOKUP(B195,INDIRECT(\"'\"&$K$1&\"'!\"&\"$C$2:$G$400\"),5,FALSE),\"\")","v":2.8277777777777775},{"$f":"IFERROR(VLOOKUP(B195,INDIRECT(\"'\"&$K$1&\"'!\"&\"$C$2:$H$400\"),6,FALSE),0)","v":49.741697416974183},{"$f":"IFERROR(VLOOKUP(B195,INDIRECT(\"'\"&$M$1&\"'!\"&\"$C$2:$H$200\"),5,FALSE),\"\")","v":""},{"$f":"IFERROR(VLOOKUP(B195,INDIRECT(\"'\"&$M$1&\"'!\"&\"$C$2:$H$200\"),6,FALSE),0)","v":0},{"$f":"IFERROR(VLOOKUP(B195,INDIRECT(\"'\"&$O$1&\"'!\"&\"$C$2:$G$200\"),4,FALSE),\"\")","v":""},{"$f":"IFERROR(VLOOKUP(B195,INDIRECT(\"'\"&$O$1&\"'!\"&\"$C$2:$G$200\"),5,FALSE),0)","v":0},{"$f":"IFERROR(VLOOKUP(B195,INDIRECT(\"'\"&$Q$1&\"'!\"&\"$C$2:$G$200\"),4,FALSE),\"\")","v":""},{"$f":"6-COUNTIF(G195:Q195,\"\")","v":1},{"$f":"F195/IF(R195>4,5,R195)","v":49.741697416974183}]
[194,"Haydn Griffiths","Mynyddwyr de Cymru","M","MO50",{"$f":"SUM(LARGE((H196,J196,L196,N196,P196),{1,2,3,4,5}))","v":49.520295202952028},"",0,"",0,2.8319444444444444,49.520295202952028,"",0,"",0,"",1,49.520295202952028]
[195,"Emma Battensby","Unattached","F","FU40",{"$f":"SUM(LARGE((H197,J197,L197,N197,P197),{1,2,3,4,5}))","v":49.409594095940967},"",0,"",0,2.8340277777777776,49.409594095940967,"",0,"",0,"",1,49.409594095940967]
[196,"Elaine Wharmby","Pegasus RC","F","FO50",{"$f":"SUM(LARGE((H198,J198,L198,N198,P198),{1,2,3,4,5}))","v":49.225092250922508},"",0,"",0,2.8374999999999999,49.225092250922508,"",0,"",0,"",1,49.225092250922508]
[197,"Adrian Eggleton","Unattached","M","MO40",{"$f":"SUM(LARGE((H199,J199,L199,N199,P199),{1,2,3,4,5}))","v":48.523985239852394},"",0,"",0,2.8506944444444446,48.523985239852394,"",0,"",0,"",1,48.523985239852394]
[198,"Julie Scholey","Les Croupiers RC","F","FO50",{"$f":"SUM(LARGE((H200,J200,L200,N200,P200),{1,2,3,4,5}))","v":48.154981549815503},"",0,"",0,2.8576388888888888,48.154981549815503,"",0,"",0,"",1,48.154981549815503]
[199,"Hywel Williams","Caerphilly Runners","M","MU40",{"$f":"SUM(LARGE((H201,J201,L201,N201,P201),{1,2,3,4,5}))","v":47.712177121771226},"",0,"",0,2.8659722222222221,47.712177121771226,"",0,"",0,"",1,47.712177121771226]
[200,"Stephen Wood","Pegasus RC","M","MU40",{"$f":"SUM(LARGE((H202,J202,L202,N202,P202),{1,2,3,4,5}))","v":47.675276752767523},"",0,"",0,2.8666666666666667,47.675276752767523,"",0,"",0,"",1,47.675276752767523]
[201,"Joyce Dodd","Chepstow Harriers","F","F060",{"$f":"SUM(LARGE((H203,J203,L203,N203,P203),{1,2,3,4,5}))","v":47.56457564575647},"",0,"",0,2.8687499999999999,47.56457564575647,"",0,"",0,"",1,47.56457564575647]
[202,"Jenni Bell","Chepstow Harriers","F","FO40",{"$f":"SUM(LARGE((H204,J204,L204,N204,P204),{1,2,3,4,5}))","v":46.863468634686335},"",0,"",0,2.8819444444444446,46.863468634686335,"",0,"",0,"",1,46.863468634686335]
[203,"Andrew Oliver","Chepstow Harriers","M","MO40",{"$f":"SUM(LARGE((H205,J205,L205,N205,P205),{1,2,3,4,5}))","v":46.752767527675275},"",0,"",0,2.8840277777777779,46.752767527675275,"",0,"",0,"",1,46.752767527675275]
[204,"Martin Charles","Pontyclun Road Runners","M","MU40",{"$f":"SUM(LARGE((H206,J206,L206,N206,P206),{1,2,3,4,5}))","v":46.605166051660518},"",0,"",0,2.8868055555555556,46.605166051660518,"",0,"",0,"",1,46.605166051660518]
[205,"Paula Allen","Pegasus RC","F","FO40",{"$f":"SUM(LARGE((H207,J207,L207,N207,P207),{1,2,3,4,5}))","v":46.568265682656843},"",0,"",0,2.8874999999999997,46.568265682656843,"",0,"",0,"",1,46.568265682656843]
[206,"Chris Chambost","Pontyclun Road Runners","M","MU40",{"$f":"SUM(LARGE((H208,J208,L208,N208,P208),{1,2,3,4,5}))","v":46.494464944649437},"",0,"",0,2.8888888888888888,46.494464944649437,"",0,"",0,"",1,46.494464944649437]
[207,"Heidi Thomas","Unattached","F","FU40",{"$f":"SUM(LARGE((H209,J209,L209,N209,P209),{1,2,3,4,5}))","v":46.457564575645783},"",0,"",0,2.8895833333333329,46.457564575645783,"",0,"",0,"",1,46.457564575645783]
[208,"Kevin Fowler","Pegasus RC","M","MO50",{"$f":"SUM(LARGE((H210,J210,L210,N210,P210),{1,2,3,4,5}))","v":46.051660516605168},"",0,"",0,2.8972222222222221,46.051660516605168,"",0,"",0,"",1,46.051660516605168]
[209,"David E Williams","Les Croupiers RC","M","MO50",{"$f":"SUM(LARGE((H211,J211,L211,N211,P211),{1,2,3,4,5}))","v":46.014760147601464},"",0,"",0,2.8979166666666667,46.014760147601464,"",0,"",0,"",1,46.014760147601464]
[210,"Jane Ash","Les Croupiers RC","F","FO40",{"$f":"SUM(LARGE((H212,J212,L212,N212,P212),{1,2,3,4,5}))","v":45.682656826568248},"",0,"",0,2.9041666666666668,45.682656826568248,"",0,"",0,"",1,45.682656826568248]
[211,"Caroline Dallimore","Les Croupiers RC","F","FO60",{"$f":"SUM(LARGE((H213,J213,L213,N213,P213),{1,2,3,4,5}))","v":45.38745387453875},"",0,"",0,2.9097222222222219,45.38745387453875,"",0,"",0,"",1,45.38745387453875]
[212,"Kevin Duncan","Unattached","M","MU40",{"$f":"SUM(LARGE((H214,J214,L214,N214,P214),{1,2,3,4,5}))","v":44.686346863468614},"",0,"",0,2.9229166666666671,44.686346863468614,"",0,"",0,"",1,44.686346863468614]
[213,"Neil Stephens","Unattached","M","MU40",{"$f":"SUM(LARGE((H215,J215,L215,N215,P215),{1,2,3,4,5}))","v":44.243542435424366},"",0,"",0,2.9312499999999999,44.243542435424366,"",0,"",0,"",1,44.243542435424366]
[214,"Beth Lewis","Les Croupiers RC","F","FU40",{"$f":"SUM(LARGE((H216,J216,L216,N216,P216),{1,2,3,4,5}))","v":44.132841328413264},"",0,"",0,2.9333333333333336,44.132841328413264,"",0,"",0,"",1,44.132841328413264]
[215,"Matt Robertson","Penarth & Dinas Runners","M","MU40",{"$f":"SUM(LARGE((H217,J217,L217,N217,P217),{1,2,3,4,5}))","v":44.022140221402204},"",0,"",0,2.9354166666666668,44.022140221402204,"",0,"",0,"",1,44.022140221402204]
[216,"Rebecca Brumbill","Pontyclun Road Runners","F","FU40",{"$f":"SUM(LARGE((H218,J218,L218,N218,P218),{1,2,3,4,5}))","v":43.431734317343171},"",0,"",0,2.9465277777777779,43.431734317343171,"",0,"",0,"",1,43.431734317343171]
[217,"Sara Macbride-Stewart","Unattached","F","FO40",{"$f":"SUM(LARGE((H219,J219,L219,N219,P219),{1,2,3,4,5}))","v":43.136531365313679},"",0,"",0,2.9520833333333329,43.136531365313679,"",0,"",0,"",1,43.136531365313679]
[218,"Les Pugh",{"$f":"IFERROR(VLOOKUP(B220,INDIRECT(\"'\"&$M$1&\"'!\"&\"$C$2:$H$400\"),2,FALSE),\"\")","v":"MDC"},{"$f":"IFERROR(VLOOKUP(B220,INDIRECT(\"'\"&$M$1&\"'!\"&\"$C$2:$H$400\"),3,FALSE),\"\")","v":"M"},{"$f":"IFERROR(VLOOKUP(B220,INDIRECT(\"'\"&$M$1&\"'!\"&\"$C$2:$H$400\"),4,FALSE),\"\")","v":"M060"},{"$f":"SUM(LARGE((H220,J220,L220,N220,P220),{1,2,3,4,5}))","v":43.021386074931669},"",0,"",0,"",0,4.5196759259259256E-2,43.021386074931669,"",0,"",1,43.021386074931669]
[219,"Kim Carwardine",{"$f":"IFERROR(VLOOKUP(B221,INDIRECT(\"'\"&$K$1&\"'!\"&\"$C$2:$H$200\"),2,FALSE),\"\")","v":"Chepstow Harriers"},{"$f":"IFERROR(VLOOKUP(B221,INDIRECT(\"'\"&$K$1&\"'!\"&\"$C$2:$H$200\"),3,FALSE),\"\")","v":"F"},{"$f":"IFERROR(VLOOKUP(B221,INDIRECT(\"'\"&$K$1&\"'!\"&\"$C$2:$H$200\"),4,FALSE),\"\")","v":"FU40"},{"$f":"SUM(LARGE((H221,J221,L221,N221,P221),{1,2,3,4,5}))","v":42.76752767527676},"",0,"",0,2.9590277777777776,42.76752767527676,"",0,"",0,"",1,42.76752767527676]
[220,"Gavin Simon","Unattached","M","MU40",{"$f":"SUM(LARGE((H222,J222,L222,N222,P222),{1,2,3,4,5}))","v":42.656826568265707},"",0,"",0,2.9611111111111108,42.656826568265707,"",0,"",0,"",1,42.656826568265707]
[221,"Gwen Richards","Pontypridd Roadents","F","FU23",{"$f":"SUM(LARGE((H223,J223,L223,N223,P223),{1,2,3,4,5}))","v":42.472324723247226},"",0,"",0,2.9645833333333336,42.472324723247226,"",0,"",0,"",1,42.472324723247226]
[222,"Chris Purdon","Unattached","M","MO50",{"$f":"SUM(LARGE((H224,J224,L224,N224,P224),{1,2,3,4,5}))","v":42.066420664206646},"",0,"",0,2.9722222222222219,42.066420664206646,"",0,"",0,"",1,42.066420664206646]
[223,"Christine Farr","SWOC","F","FO40",{"$f":"SUM(LARGE((H225,J225,L225,N225,P225),{1,2,3,4,5}))","v":41.660516605166052},"",0,"",0,2.9798611111111111,41.660516605166052,"",0,"",0,"",1,41.660516605166052]
[224,"Peter Jenkins","Unattached","M","MU40",{"$f":"SUM(LARGE((H226,J226,L226,N226,P226),{1,2,3,4,5}))","v":41.328413284132836},"",0,"",0,2.9861111111111112,41.328413284132836,"",0,"",0,"",1,41.328413284132836]
[225,"Jen Danger Harding","Chepstow Harriers","F","FU40",{"$f":"SUM(LARGE((H227,J227,L227,N227,P227),{1,2,3,4,5}))","v":40.996309963099641},"",0,"",0,2.9923611111111108,40.996309963099641,"",0,"",0,"",1,40.996309963099641]
[226,"Abigail Foulkes","Unattached","F","FU40",{"$f":"SUM(LARGE((H228,J228,L228,N228,P228),{1,2,3,4,5}))","v":40.81180811808116},"",0,"",0,2.9958333333333336,40.81180811808116,"",0,"",0,"",1,40.81180811808116]
[227,"Chris Selby","San Domenico RC","M","MO40",{"$f":"SUM(LARGE((H229,J229,L229,N229,P229),{1,2,3,4,5}))","v":40.81180811808116},"",0,"",0,2.9958333333333336,40.81180811808116,"",0,"",0,"",1,40.81180811808116]
[228,"Alan Roberts",{"$f":"IFERROR(VLOOKUP(B230,INDIRECT(\"'\"&$K$1&\"'!\"&\"$C$2:$H$400\"),2,FALSE),\"\")","v":"Port Talbot Harriers"},{"$f":"IFERROR(VLOOKUP(B230,INDIRECT(\"'\"&$K$1&\"'!\"&\"$C$2:$H$400\"),3,FALSE),\"\")","v":"M"},{"$f":"IFERROR(VLOOKUP(B230,INDIRECT(\"'\"&$K$1&\"'!\"&\"$C$2:$H$400\"),4,FALSE),\"\")","v":"MO60"},{"$f":"SUM(LARGE((H230,J230,L230,N230,P230),{1,2,3,4,5}))","v":40.701107011070107},"",{"$f":"IFERROR(VLOOKUP(B230,INDIRECT(\"'\"&$G$1&\"'!\"&\"$C$2:$H$400\"),6,FALSE),0)","v":0},"",0,2.9979166666666668,40.701107011070107,"",0,"",0,"",1,40.701107011070107]
[229,"Andrew Isaac","Unattached","M","MO50",{"$f":"SUM(LARGE((H231,J231,L231,N231,P231),{1,2,3,4,5}))","v":40.664206642066404},"",{"$f":"IFERROR(VLOOKUP(B231,INDIRECT(\"'\"&$G$1&\"'!\"&\"$C$2:$H$200\"),6,FALSE),0)","v":0},"",0,2.9986111111111113,40.664206642066404,"",0,"",0,"",1,40.664206642066404]
[230,"Jonathan Parkes","Unattached","M","MU40",{"$f":"SUM(LARGE((H232,J232,L232,N232,P232),{1,2,3,4,5}))","v":40.369003690036905},"",0,"",0,3.0041666666666664,40.369003690036905,"",0,"",0,"",1,40.369003690036905]
[231,"Charlotte Goodwin","Unattached","F","FU40",{"$f":"SUM(LARGE((H233,J233,L233,N233,P233),{1,2,3,4,5}))","v":40.295202952029484},"",0,"",0,3.005555555555556,40.295202952029484,"",0,"",0,"",1,40.295202952029484]
[232,"Jonathan Mead","Pontyclun Road Runners","M","MO50",{"$f":"SUM(LARGE((H234,J234,L234,N234,P234),{1,2,3,4,5}))","v":40.258302583025831},"",0,"",0,3.0062500000000001,40.258302583025831,"",0,"",0,"",1,40.258302583025831]
[233,"Christopher Shorrock","Unattached","M","MO40",{"$f":"SUM(LARGE((H235,J235,L235,N235,P235),{1,2,3,4,5}))","v":39.2988929889299},"",0,"",0,3.0243055555555554,39.2988929889299,"",0,"",0,"",1,39.2988929889299]
[234,"Rhian Durham","Pontypridd Roadents","F","FU40",{"$f":"SUM(LARGE((H236,J236,L236,N236,P236),{1,2,3,4,5}))","v":39.040590405904041},"",0,"",0,3.0291666666666668,39.040590405904041,"",0,"",0,"",1,39.040590405904041]
[235,"Ben Gooding","Pegasus RC","M","MU40",{"$f":"SUM(LARGE((H237,J237,L237,N237,P237),{1,2,3,4,5}))","v":38.929889298892981},"",0,"",0,3.03125,38.929889298892981,"",0,"",0,"",1,38.929889298892981]
[236,"Emma Bissex","Pegasus RC","F","FU40",{"$f":"SUM(LARGE((H238,J238,L238,N238,P238),{1,2,3,4,5}))","v":38.892988929889285},"",0,"",0,3.0319444444444446,38.892988929889285,"",0,"",0,"",1,38.892988929889285]
[237,"Stephen Quin","Les Croupiers RC","M","MO40",{"$f":"SUM(LARGE((H239,J239,L239,N239,P239),{1,2,3,4,5}))","v":38.634686346863447},"",0,"",0,3.036805555555556,38.634686346863447,"",0,"",0,"",1,38.634686346863447]
[238,"Anne Follan","Roberttown Runners","F","FO40",{"$f":"SUM(LARGE((H240,J240,L240,N240,P240),{1,2,3,4,5}))","v":37.933579335793333},"",0,"",0,3.0500000000000003,37.933579335793333,"",0,"",0,"",1,37.933579335793333]
[239,"Katie Mortimer-Jones","Pontyclun Road Runners","F","FU40",{"$f":"SUM(LARGE((H241,J241,L241,N241,P241),{1,2,3,4,5}))","v":37.896678966789679},"",0,"",0,3.0506944444444444,37.896678966789679,"",0,"",0,"",1,37.896678966789679]
[240,"Laura Jones","Unattached","F","FO40",{"$f":"SUM(LARGE((H242,J242,L242,N242,P242),{1,2,3,4,5}))","v":37.638376383763841},"",0,"",0,3.0555555555555554,37.638376383763841,"",0,"",0,"",1,37.638376383763841]
[241,"Christie Coleman","Cwm Ogwr RC","M","MO40",{"$f":"SUM(LARGE((H243,J243,L243,N243,P243),{1,2,3,4,5}))","v":37.564575645756484},"",0,"",0,3.056944444444444,37.564575645756484,"",0,"",0,"",1,37.564575645756484]
[242,"Paul Edwards","Cardiff AAC","M","MO40",{"$f":"SUM(LARGE((H244,J244,L244,N244,P244),{1,2,3,4,5}))","v":36.900369003690024},"",0,"",0,3.0694444444444446,36.900369003690024,"",0,"",0,"",1,36.900369003690024]
[243,"Rebecca Christy","Unattached","F","FU40",{"$f":"SUM(LARGE((H245,J245,L245,N245,P245),{1,2,3,4,5}))","v":36.826568265682646},"",0,"",0,3.0708333333333333,36.826568265682646,"",0,"",0,"",1,36.826568265682646]
[244,"Jon Reynolds","Unattached","M","MU40",{"$f":"SUM(LARGE((H246,J246,L246,N246,P246),{1,2,3,4,5}))","v":36.605166051660532},"",0,"",0,3.0749999999999997,36.605166051660532,"",0,"",0,"",1,36.605166051660532]
[245,"Elizabeth Iefrat",{"$f":"IFERROR(VLOOKUP(B247,INDIRECT(\"'\"&$M$1&\"'!\"&\"$C$2:$H$400\"),2,FALSE),\"\")","v":"U/A"},{"$f":"IFERROR(VLOOKUP(B247,INDIRECT(\"'\"&$M$1&\"'!\"&\"$C$2:$H$400\"),3,FALSE),\"\")","v":"F"},{"$f":"IFERROR(VLOOKUP(B247,INDIRECT(\"'\"&$M$1&\"'!\"&\"$C$2:$H$400\"),4,FALSE),\"\")","v":"FU40"},{"$f":"SUM(LARGE((H247,J247,L247,N247,P247),{1,2,3,4,5}))","v":36.54928445087635},"",0,"",0,"",0,4.7060185185185184E-2,36.54928445087635,"",0,"",1,36.54928445087635]
[246,"Sian Khalil",{"$f":"IFERROR(VLOOKUP(B248,INDIRECT(\"'\"&$K$1&\"'!\"&\"$C$2:$H$400\"),2,FALSE),\"\")","v":"Pontypridd Roadents"},{"$f":"IFERROR(VLOOKUP(B248,INDIRECT(\"'\"&$K$1&\"'!\"&\"$C$2:$H$400\"),3,FALSE),\"\")","v":"F"},{"$f":"IFERROR(VLOOKUP(B248,INDIRECT(\"'\"&$K$1&\"'!\"&\"$C$2:$H$400\"),4,FALSE),\"\")","v":"FO40"},{"$f":"SUM(LARGE((H248,J248,L248,N248,P248),{1,2,3,4,5}))","v":36.236162361623613},"",0,"",0,3.0819444444444444,36.236162361623613,"",0,"",0,"",1,36.236162361623613]
[247,"Carrie Perry","Roberttown Runners","F","FO40",{"$f":"SUM(LARGE((H249,J249,L249,N249,P249),{1,2,3,4,5}))","v":36.088560885608857},"",0,"",0,3.0847222222222221,36.088560885608857,"",0,"",0,"",1,36.088560885608857]
[248,"Fiona Drysdale","Cwm Ogwr RC","F","FO40",{"$f":"SUM(LARGE((H250,J250,L250,N250,P250),{1,2,3,4,5}))","v":35.977859778597796},"",0,"",0,3.0868055555555554,35.977859778597796,"",0,"",0,"",1,35.977859778597796]
[249,"Glyn Hicks","Islwyn RC","M","MO60",{"$f":"SUM(LARGE((H251,J251,L251,N251,P251),{1,2,3,4,5}))","v":35.719557195571937},"",0,"",0,3.0916666666666668,35.719557195571937,"",0,"",0,"",1,35.719557195571937]
[250,"Natalee Murphy","Roberttown Runners","F","FU40",{"$f":"SUM(LARGE((H252,J252,L252,N252,P252),{1,2,3,4,5}))","v":35.719557195571937},"",0,"",0,3.0916666666666668,35.719557195571937,"",0,"",0,"",1,35.719557195571937]
[251,"Emma Chivers","Unattached","F","FO40",{"$f":"SUM(LARGE((H253,J253,L253,N253,P253),{1,2,3,4,5}))","v":35.350553505535068},"",0,"",0,3.098611111111111,35.350553505535068,"",0,"",0,"",1,35.350553505535068]
[252,"Jeff Davies","Unattached","M","MO50",{"$f":"SUM(LARGE((H254,J254,L254,N254,P254),{1,2,3,4,5}))","v":35.350553505535068},"",0,"",0,3.098611111111111,35.350553505535068,"",0,"",0,"",1,35.350553505535068]
[253,"Charlotte Barlow","Brackla Harriers","F","FU40",{"$f":"SUM(LARGE((H255,J255,L255,N255,P255),{1,2,3,4,5}))","v":34.686346863468628},"",0,"",0,3.1111111111111112,34.686346863468628,"",0,"",0,"",1,34.686346863468628]
[254,"Sophie Gott","Hendre Lake RC","F","FU40",{"$f":"SUM(LARGE((H256,J256,L256,N256,P256),{1,2,3,4,5}))","v":34.501845018450169},"",0,"",0,3.1145833333333335,34.501845018450169,"",0,"",0,"",1,34.501845018450169]
[255,"Dewi Hughes","Unattached","M","MO60",{"$f":"SUM(LARGE((H257,J257,L257,N257,P257),{1,2,3,4,5}))","v":32.841328413284131},"",0,"",0,3.1458333333333335,32.841328413284131,"",0,"",0,"",1,32.841328413284131]
[256,"Ian James","Unattached","M","MU40",{"$f":"SUM(LARGE((H258,J258,L258,N258,P258),{1,2,3,4,5}))","v":32.841328413284131},"",0,"",0,3.1458333333333335,32.841328413284131,"",0,"",0,"",1,32.841328413284131]
[{"$f":"ROW(A257)","v":257},"Jemma Nurse","Les Croupiers RC","F","FO40",{"$f":"SUM(LARGE((H259,J259,L259,N259,P259),{1,2,3,4,5}))","v":32.435424354243537},{"$f":"IFERROR(VLOOKUP(B259,INDIRECT(\"'\"&$G$1&\"'!\"&\"$C$2:$H$200\"),5,FALSE),\"\")","v":""},0,{"$f":"IFERROR(VLOOKUP(B259,INDIRECT(\"'\"&$I$1&\"'!\"&\"$C$2:$G$200\"),5,FALSE),\"\")","v":""},{"$f":"IFERROR(VLOOKUP(B259,INDIRECT(\"'\"&$I$1&\"'!\"&\"$C$2:$H$200\"),6,FALSE),0)","v":0},{"$f":"IFERROR(VLOOKUP(B259,INDIRECT(\"'\"&$K$1&\"'!\"&\"$C$2:$G$400\"),5,FALSE),\"\")","v":3.1534722222222222},{"$f":"IFERROR(VLOOKUP(B259,INDIRECT(\"'\"&$K$1&\"'!\"&\"$C$2:$H$400\"),6,FALSE),0)","v":32.435424354243537},{"$f":"IFERROR(VLOOKUP(B259,INDIRECT(\"'\"&$M$1&\"'!\"&\"$C$2:$H$200\"),5,FALSE),\"\")","v":""},{"$f":"IFERROR(VLOOKUP(B259,INDIRECT(\"'\"&$M$1&\"'!\"&\"$C$2:$H$200\"),6,FALSE),0)","v":0},{"$f":"IFERROR(VLOOKUP(B259,INDIRECT(\"'\"&$O$1&\"'!\"&\"$C$2:$G$200\"),4,FALSE),\"\")","v":""},{"$f":"IFERROR(VLOOKUP(B259,INDIRECT(\"'\"&$O$1&\"'!\"&\"$C$2:$G$200\"),5,FALSE),0)","v":0},{"$f":"IFERROR(VLOOKUP(B259,INDIRECT(\"'\"&$Q$1&\"'!\"&\"$C$2:$G$200\"),4,FALSE),\"\")","v":""},{"$f":"6-COUNTIF(G259:Q259,\"\")","v":1},{"$f":"F259/IF(R259>4,5,R259)","v":32.435424354243537}]
[258,"Lowri Roberts","Les Croupiers RC","F","FO40",{"$f":"SUM(LARGE((H260,J260,L260,N260,P260),{1,2,3,4,5}))","v":32.103321033210342},"",0,"",0,3.1597222222222219,32.103321033210342,"",0,"",0,"",1,32.103321033210342]
[259,"Nathan Jones","Pontypridd Roadents","M","MU40",{"$f":"SUM(LARGE((H261,J261,L261,N261,P261),{1,2,3,4,5}))","v":31.217712177121768},"",0,"",0,3.1763888888888889,31.217712177121768,"",0,"",0,"",1,31.217712177121768]
[260,"Simon Watts","Unattached","M","MU40",{"$f":"SUM(LARGE((H262,J262,L262,N262,P262),{1,2,3,4,5}))","v":30.885608856088552},"",0,"",0,3.182638888888889,30.885608856088552,"",0,"",0,"",1,30.885608856088552]
[261,"Antol Sandor",{"$f":"IFERROR(VLOOKUP(B263,INDIRECT(\"'\"&$M$1&\"'!\"&\"$C$2:$H$400\"),2,FALSE),\"\")","v":"Mynydd Du"},{"$f":"IFERROR(VLOOKUP(B263,INDIRECT(\"'\"&$M$1&\"'!\"&\"$C$2:$H$400\"),3,FALSE),\"\")","v":"M"},{"$f":"IFERROR(VLOOKUP(B263,INDIRECT(\"'\"&$M$1&\"'!\"&\"$C$2:$H$400\"),4,FALSE),\"\")","v":"MO40"},{"$f":"SUM(LARGE((H263,J263,L263,N263,P263),{1,2,3,4,5}))","v":30.639974272391047},"",{"$f":"IFERROR(VLOOKUP(B263,INDIRECT(\"'\"&$G$1&\"'!\"&\"$C$2:$H$200\"),6,FALSE),0)","v":0},"",0,"",0,4.8761574074074075E-2,30.639974272391047,"",0,"",1,30.639974272391047]
[262,"John Ayres",{"$f":"IFERROR(VLOOKUP(B264,INDIRECT(\"'\"&$K$1&\"'!\"&\"$C$2:$H$400\"),2,FALSE),\"\")","v":"Port Talbot Harriers"},{"$f":"IFERROR(VLOOKUP(B264,INDIRECT(\"'\"&$K$1&\"'!\"&\"$C$2:$H$400\"),3,FALSE),\"\")","v":"M"},{"$f":"IFERROR(VLOOKUP(B264,INDIRECT(\"'\"&$K$1&\"'!\"&\"$C$2:$H$400\"),4,FALSE),\"\")","v":"MO60"},{"$f":"SUM(LARGE((H264,J264,L264,N264,P264),{1,2,3,4,5}))","v":30.000000000000004},"",0,"",0,3.1993055555555556,30.000000000000004,"",0,"",0,"",1,30.000000000000004]
[263,"Penny Aubrey","Unattached","F","FU40",{"$f":"SUM(LARGE((H265,J265,L265,N265,P265),{1,2,3,4,5}))","v":29.778597785977844},"",0,"",0,3.2034722222222225,29.778597785977844,"",0,"",0,"",1,29.778597785977844]
[264,"Joanne Lombardi","Unattached","F","FU40",{"$f":"SUM(LARGE((H266,J266,L266,N266,P266),{1,2,3,4,5}))","v":29.55719557195571},"",0,"",0,3.2076388888888889,29.55719557195571,"",0,"",0,"",1,29.55719557195571]
[265,"Anna Helsing","Penarth & Dinas Runners","F","FO50",{"$f":"SUM(LARGE((H267,J267,L267,N267,P267),{1,2,3,4,5}))","v":29.298892988929893},"",0,"",0,3.2124999999999999,29.298892988929893,"",0,"",0,"",1,29.298892988929893]
[266,"Giulia Teso","Unattached","F","FU40",{"$f":"SUM(LARGE((H268,J268,L268,N268,P268),{1,2,3,4,5}))","v":29.22509225092249},"",0,"",0,3.213888888888889,29.22509225092249,"",0,"",0,"",1,29.22509225092249]
[267,"Lucy McCobb","Pontyclun Road Runners","F","FO40",{"$f":"SUM(LARGE((H269,J269,L269,N269,P269),{1,2,3,4,5}))","v":29.151291512915112},"",0,"",0,3.2152777777777781,29.151291512915112,"",0,"",0,"",1,29.151291512915112]
[268,"Graeme Donnan","Les Croupiers RC","M","MO60",{"$f":"SUM(LARGE((H270,J270,L270,N270,P270),{1,2,3,4,5}))","v":28.487084870848701},"",0,"",0,3.2277777777777779,28.487084870848701,"",0,"",0,"",1,28.487084870848701]
[269,"John Payne","Unattached","M","MO50",{"$f":"SUM(LARGE((H271,J271,L271,N271,P271),{1,2,3,4,5}))","v":28.007380073800725},"",0,"",0,3.2368055555555557,28.007380073800725,"",0,"",0,"",1,28.007380073800725]
[270,"Ray James","Port Talbot Harriers","M","MO50",{"$f":"SUM(LARGE((H272,J272,L272,N272,P272),{1,2,3,4,5}))","v":26.199261992619927},"",0,"",0,3.2708333333333335,26.199261992619927,"",0,"",0,"",1,26.199261992619927]
[271,"Mike Jones","Unattached","M","MO40",{"$f":"SUM(LARGE((H273,J273,L273,N273,P273),{1,2,3,4,5}))","v":25.977859778597789},"",0,"",0,3.2749999999999999,25.977859778597789,"",0,"",0,"",1,25.977859778597789]
[272,"Nicola Bowman","Unattached","F","FO40",{"$f":"SUM(LARGE((H274,J274,L274,N274,P274),{1,2,3,4,5}))","v":25.940959409594111},"",0,"",0,3.275694444444444,25.940959409594111,"",0,"",0,"",1,25.940959409594111]
[273,"Fiona Hillen","Unattached","F","FU40",{"$f":"SUM(LARGE((H275,J275,L275,N275,P275),{1,2,3,4,5}))","v":24.428044280442805},"",0,"",0,3.3041666666666667,24.428044280442805,"",0,"",0,"",1,24.428044280442805]
[274,"Jen Williams","Caerphilly Runners","F","FU40",{"$f":"SUM(LARGE((H276,J276,L276,N276,P276),{1,2,3,4,5}))","v":22.361623616236169},"",0,"",0,3.3430555555555554,22.361623616236169,"",0,"",0,"",1,22.361623616236169]
[275,"Michaela John","Unattached","F","FO40",{"$f":"SUM(LARGE((H277,J277,L277,N277,P277),{1,2,3,4,5}))","v":22.361623616236169},"",0,"",0,3.3430555555555554,22.361623616236169,"",0,"",0,"",1,22.361623616236169]
[276,"Jenna Groves","Pegasus RC","F","FU40",{"$f":"SUM(LARGE((H278,J278,L278,N278,P278),{1,2,3,4,5}))","v":21.808118081180794},"",0,"",0,3.3534722222222224,21.808118081180794,"",0,"",0,"",1,21.808118081180794]
[277,"Hugh Morgan","Eryri Harriers","M","MO40",{"$f":"SUM(LARGE((H279,J279,L279,N279,P279),{1,2,3,4,5}))","v":21.771217712177137},"",0,"",0,3.3541666666666665,21.771217712177137,"",0,"",0,"",1,21.771217712177137]
[278,"Sarah Evans ","San Domenico RC","F","FO40",{"$f":"SUM(LARGE((H280,J280,L280,N280,P280),{1,2,3,4,5}))","v":20.996309963099623},"",0,"",0,3.3687499999999999,20.996309963099623,"",0,"",0,"",1,20.996309963099623]
[279,"James Harris","Pontyclun Road Runners","M","MU40",{"$f":"SUM(LARGE((H281,J281,L281,N281,P281),{1,2,3,4,5}))","v":20.922509225092245},"",0,"",0,3.370138888888889,20.922509225092245,"",0,"",0,"",1,20.922509225092245]
[280,"Michelle Hoey","Penarth & Dinas Runners","F","FU40",{"$f":"SUM(LARGE((H282,J282,L282,N282,P282),{1,2,3,4,5}))","v":20.922509225092245},"",0,"",0,3.370138888888889,20.922509225092245,"",0,"",0,"",1,20.922509225092245]
[281,"Ruth Owens","Penarth & Dinas Runners","F","FU40",{"$f":"SUM(LARGE((H283,J283,L283,N283,P283),{1,2,3,4,5}))","v":20.885608856088545},"",0,"",0,3.3708333333333336,20.885608856088545,"",0,"",0,"",1,20.885608856088545]
[282,"Nicola Tonge","Unattached","F","FO40",{"$f":"SUM(LARGE((H284,J284,L284,N284,P284),{1,2,3,4,5}))","v":18.339483394833955},"",0,"",0,3.4187499999999997,18.339483394833955,"",0,"",0,"",1,18.339483394833955]
[283,"Liz Stead","Unattached","F","FO50",{"$f":"SUM(LARGE((H285,J285,L285,N285,P285),{1,2,3,4,5}))","v":18.265682656826577},"",0,"",0,3.4201388888888888,18.265682656826577,"",0,"",0,"",1,18.265682656826577]
[284,"Matthew Harris","Pontyclun Road Runners","M","MO50",{"$f":"SUM(LARGE((H286,J286,L286,N286,P286),{1,2,3,4,5}))","v":17.416974169741685},"",0,"",0,3.4361111111111113,17.416974169741685,"",0,"",0,"",1,17.416974169741685]
[285,"Pat Searle","Unattached","F","FO50",{"$f":"SUM(LARGE((H287,J287,L287,N287,P287),{1,2,3,4,5}))","v":17.195571955719547},"",0,"",0,3.4402777777777778,17.195571955719547,"",0,"",0,"",1,17.195571955719547]
[286,"Harriet Like","","","",{"$f":"SUM(LARGE((H288,J288,L288,N288,P288),{1,2,3,4,5}))","v":13.171465406102257},"00:28:59",13.171465406102257,"",0,"",0,"",0,"",0,"",1,13.171465406102257]
[287,"Chris Todd Jones","Roberttown Runners","M","MO60",{"$f":"SUM(LARGE((H289,J289,L289,N289,P289),{1,2,3,4,5}))","v":8.3763837638376479},"",0,"",0,3.6062499999999997,8.3763837638376479,"",0,"",0,"",1,8.3763837638376479]
[288,"Nia Kirk","Unattached","F","FU40",{"$f":"SUM(LARGE((H290,J290,L290,N290,P290),{1,2,3,4,5}))","v":7.896678966789672},"",0,"",0,3.6152777777777776,7.896678966789672,"",0,"",0,"",1,7.896678966789672]
[289,"Kelly-Ann Allen","Port Talbot Harriers","F","FU40",{"$f":"SUM(LARGE((H291,J291,L291,N291,P291),{1,2,3,4,5}))","v":7.8597785977859713},"",0,"",0,3.6159722222222221,7.8597785977859713,"",0,"",0,"",1,7.8597785977859713]
[290,"Kristina Salmone","CDF Runners","F","FU40",{"$f":"SUM(LARGE((H292,J292,L292,N292,P292),{1,2,3,4,5}))","v":6.6051660516605271},"",0,"",0,3.6395833333333329,6.6051660516605271,"",0,"",0,"",1,6.6051660516605271]
[291,"Sian Taylor","Unattached","F","FU40",{"$f":"SUM(LARGE((H293,J293,L293,N293,P293),{1,2,3,4,5}))","v":1.8450184501844991},"",0,"",0,3.7291666666666665,1.8450184501844991,"",0,"",0,"",1,1.8450184501844991]
[{"$f":"ROW(A293)","v":293},"Beata Jakubvak","Unattached","F","FO40",{"$f":"SUM(LARGE((H294,J294,L294,N294,P294),{1,2,3,4,5}))","v":0},"",0,"",0,4.0034722222222223,0,"",0,"",0,"",1,0]
[{"$f":"ROW(A294)","v":294},"Daphne Austerberry","Chepstow Harriers","F","FO60",{"$f":"SUM(LARGE((H295,J295,L295,N295,P295),{1,2,3,4,5}))","v":0},"",{"$f":"IFERROR(VLOOKUP(B295,INDIRECT(\"'\"&$G$1&\"'!\"&\"$C$2:$H$200\"),6,FALSE),0)","v":0},"",0,4.5791666666666666,0,"",0,"",0,"",1,0]
[295,"Dave Andrews","Chepstow Harriers","M","MO60",{"$f":"SUM(LARGE((H296,J296,L296,N296,P296),{1,2,3,4,5}))","v":0},"",0,"",0,3.786805555555556,0,"",0,"",0,"",1,0]
[296,"Ian Kognetho","Chepstow Harriers","M","MO50",{"$f":"SUM(LARGE((H297,J297,L297,N297,P297),{1,2,3,4,5}))","v":0},"",0,"",0,3.8000000000000003,0,"",0,"",0,"",1,0]
[297,"Jane Llewellyn","Unattached","F","FO50",{"$f":"SUM(LARGE((H298,J298,L298,N298,P298),{1,2,3,4,5}))","v":0},"",0,"",0,3.8680555555555554,0,"",0,"",0,"",1,0]
[298,"Richard Crook","Unattached","M","MO40",{"$f":"SUM(LARGE((H299,J299,L299,N299,P299),{1,2,3,4,5}))","v":0},"",0,"",0,3.8680555555555554,0,"",0,"",0,"",1,0]
[299,"Steve Hill",{"$f":"IFERROR(VLOOKUP(B300,INDIRECT(\"'\"&$K$1&\"'!\"&\"$C$2:$H$200\"),2,FALSE),\"\")","v":"Penarth & Dinas Runners"},{"$f":"IFERROR(VLOOKUP(B300,INDIRECT(\"'\"&$K$1&\"'!\"&\"$C$2:$H$200\"),3,FALSE),\"\")","v":"M"},{"$f":"IFERROR(VLOOKUP(B300,INDIRECT(\"'\"&$K$1&\"'!\"&\"$C$2:$H$200\"),4,FALSE),\"\")","v":"MO50"},{"$f":"SUM(LARGE((H300,J300,L300,N300,P300),{1,2,3,4,5}))","v":44.46494464944648},"",0,"",0,2.9270833333333335,44.46494464944648,"",0,"",0,"",1,44.46494464944648]
[300,"Steve Terry",{"$f":"IFERROR(VLOOKUP(B301,INDIRECT(\"'\"&$K$1&\"'!\"&\"$C$2:$H$400\"),2,FALSE),\"\")","v":"Unattached"},{"$f":"IFERROR(VLOOKUP(B301,INDIRECT(\"'\"&$K$1&\"'!\"&\"$C$2:$H$400\"),3,FALSE),\"\")","v":"M"},{"$f":"IFERROR(VLOOKUP(B301,INDIRECT(\"'\"&$K$1&\"'!\"&\"$C$2:$H$400\"),4,FALSE),\"\")","v":"MO40"},{"$f":"SUM(LARGE((H301,J301,L301,N301,P301),{1,2,3,4,5}))","v":40.664206642066404},"",0,"",0,2.9986111111111113,40.664206642066404,"",0,"",0,"",1,40.664206642066404]
[301,"Steven Burnett",{"$f":"IFERROR(VLOOKUP(B302,INDIRECT(\"'\"&$K$1&\"'!\"&\"$C$2:$H$200\"),2,FALSE),\"\")","v":"Unattached"},{"$f":"IFERROR(VLOOKUP(B302,INDIRECT(\"'\"&$K$1&\"'!\"&\"$C$2:$H$200\"),3,FALSE),\"\")","v":"M"},{"$f":"IFERROR(VLOOKUP(B302,INDIRECT(\"'\"&$K$1&\"'!\"&\"$C$2:$H$200\"),4,FALSE),\"\")","v":"MU40"},{"$f":"SUM(LARGE((H302,J302,L302,N302,P302),{1,2,3,4,5}))","v":57.896678966789651},"",0,"",0,2.6743055555555557,57.896678966789651,"",0,"",0,"",1,57.896678966789651]
[302,"Stewart Harding",{"$f":"IFERROR(VLOOKUP(B303,INDIRECT(\"'\"&$K$1&\"'!\"&\"$C$2:$H$200\"),2,FALSE),\"\")","v":"CDF Runners"},{"$f":"IFERROR(VLOOKUP(B303,INDIRECT(\"'\"&$K$1&\"'!\"&\"$C$2:$H$200\"),3,FALSE),\"\")","v":"M"},{"$f":"IFERROR(VLOOKUP(B303,INDIRECT(\"'\"&$K$1&\"'!\"&\"$C$2:$H$200\"),4,FALSE),\"\")","v":"MU40"},{"$f":"SUM(LARGE((H303,J303,L303,N303,P303),{1,2,3,4,5}))","v":64.797047970479696},"",0,"",0,2.5444444444444447,64.797047970479696,"",0,"",0,"",1,64.797047970479696]
[303,"Stuart Davies",{"$f":"IFERROR(VLOOKUP(B304,INDIRECT(\"'\"&$K$1&\"'!\"&\"$C$2:$H$200\"),2,FALSE),\"\")","v":"South Wales Police Tri"},{"$f":"IFERROR(VLOOKUP(B304,INDIRECT(\"'\"&$K$1&\"'!\"&\"$C$2:$H$200\"),3,FALSE),\"\")","v":"M"},{"$f":"IFERROR(VLOOKUP(B304,INDIRECT(\"'\"&$K$1&\"'!\"&\"$C$2:$H$200\"),4,FALSE),\"\")","v":"MO40"},{"$f":"SUM(LARGE((H304,J304,L304,N304,P304),{1,2,3,4,5}))","v":57.601476014760152},"",0,"",0,2.6798611111111108,57.601476014760152,"",0,"",0,"",1,57.601476014760152]
[304,"Suzanne Fancourt",{"$f":"IFERROR(VLOOKUP(B305,INDIRECT(\"'\"&$K$1&\"'!\"&\"$C$2:$H$400\"),2,FALSE),\"\")","v":"Unattached"},{"$f":"IFERROR(VLOOKUP(B305,INDIRECT(\"'\"&$K$1&\"'!\"&\"$C$2:$H$400\"),3,FALSE),\"\")","v":"F"},{"$f":"IFERROR(VLOOKUP(B305,INDIRECT(\"'\"&$K$1&\"'!\"&\"$C$2:$H$400\"),4,FALSE),\"\")","v":"FU40"},{"$f":"SUM(LARGE((H305,J305,L305,N305,P305),{1,2,3,4,5}))","v":1.8819188191881775},"",0,"",0,3.7284722222222224,1.8819188191881775,"",0,"",0,"",1,1.8819188191881775]
[305,"Thomas Burden",{"$f":"IFERROR(VLOOKUP(B306,INDIRECT(\"'\"&$K$1&\"'!\"&\"$C$2:$H$200\"),2,FALSE),\"\")","v":"Unattached"},{"$f":"IFERROR(VLOOKUP(B306,INDIRECT(\"'\"&$K$1&\"'!\"&\"$C$2:$H$200\"),3,FALSE),\"\")","v":"M"},{"$f":"IFERROR(VLOOKUP(B306,INDIRECT(\"'\"&$K$1&\"'!\"&\"$C$2:$H$200\"),4,FALSE),\"\")","v":"MU40"},{"$f":"SUM(LARGE((H306,J306,L306,N306,P306),{1,2,3,4,5}))","v":96.383763837638384},"",0,"",0,1.95,96.383763837638384,"",0,"",0,"",1,96.383763837638384]
[306,"Thomas M",{"$f":"IFERROR(VLOOKUP(B307,INDIRECT(\"'\"&$M$1&\"'!\"&\"$C$2:$H$400\"),2,FALSE),\"\")","v":"Mynydd Du"},{"$f":"IFERROR(VLOOKUP(B307,INDIRECT(\"'\"&$M$1&\"'!\"&\"$C$2:$H$400\"),3,FALSE),\"\")","v":"M"},{"$f":"IFERROR(VLOOKUP(B307,INDIRECT(\"'\"&$M$1&\"'!\"&\"$C$2:$H$400\"),4,FALSE),\"\")","v":"MU40"},{"$f":"SUM(LARGE((H307,J307,L307,N307,P307),{1,2,3,4,5}))","v":85.311143270622281},"",0,"",0,"",0,3.3020833333333333E-2,85.311143270622281,"",0,"",1,85.311143270622281]
[307,"Tim Buckley",{"$f":"IFERROR(VLOOKUP(B308,INDIRECT(\"'\"&$K$1&\"'!\"&\"$C$2:$H$200\"),2,FALSE),\"\")","v":"Chepstow Harriers"},{"$f":"IFERROR(VLOOKUP(B308,INDIRECT(\"'\"&$K$1&\"'!\"&\"$C$2:$H$200\"),3,FALSE),\"\")","v":"M"},{"$f":"IFERROR(VLOOKUP(B308,INDIRECT(\"'\"&$K$1&\"'!\"&\"$C$2:$H$200\"),4,FALSE),\"\")","v":"MO40"},{"$f":"SUM(LARGE((H308,J308,L308,N308,P308),{1,2,3,4,5}))","v":52.029520295202957},"",0,"",0,2.7847222222222219,52.029520295202957,"",0,"",0,"",1,52.029520295202957]
[308,"Tim Gibbs",{"$f":"IFERROR(VLOOKUP(B309,INDIRECT(\"'\"&$K$1&\"'!\"&\"$C$2:$H$200\"),2,FALSE),\"\")","v":"Unattached"},{"$f":"IFERROR(VLOOKUP(B309,INDIRECT(\"'\"&$K$1&\"'!\"&\"$C$2:$H$200\"),3,FALSE),\"\")","v":"M"},{"$f":"IFERROR(VLOOKUP(B309,INDIRECT(\"'\"&$K$1&\"'!\"&\"$C$2:$H$200\"),4,FALSE),\"\")","v":"MU40"},{"$f":"SUM(LARGE((H309,J309,L309,N309,P309),{1,2,3,4,5}))","v":46.715867158671578},"",0,"",0,2.8847222222222224,46.715867158671578,"",0,"",0,"",1,46.715867158671578]
[309,"Tim Hindle",{"$f":"IFERROR(VLOOKUP(B310,INDIRECT(\"'\"&$I$1&\"'!\"&\"$C$2:$H$200\"),2,FALSE),\"\")","v":"Brecon"},{"$f":"IFERROR(VLOOKUP(B310,INDIRECT(\"'\"&$I$1&\"'!\"&\"$C$2:$H$200\"),3,FALSE),\"\")","v":"M"},{"$f":"IFERROR(VLOOKUP(B310,INDIRECT(\"'\"&$I$1&\"'!\"&\"$C$2:$H$200\"),4,FALSE),\"\")","v":"MO40"},{"$f":"SUM(LARGE((H310,J310,L310,N310,P310),{1,2,3,4,5}))","v":180.50581833340959},"",0,2.1527777777777781E-2,96.077774052966802,2.1750000000000003,84.428044280442791,"",0,"",0,"",2,90.252909166704796]
[310,"Tim O'Sullivan",{"$f":"IFERROR(VLOOKUP(B311,INDIRECT(\"'\"&$K$1&\"'!\"&\"$C$2:$H$200\"),2,FALSE),\"\")","v":"Les Croupiers RC"},{"$f":"IFERROR(VLOOKUP(B311,INDIRECT(\"'\"&$K$1&\"'!\"&\"$C$2:$H$200\"),3,FALSE),\"\")","v":"M"},{"$f":"IFERROR(VLOOKUP(B311,INDIRECT(\"'\"&$K$1&\"'!\"&\"$C$2:$H$200\"),4,FALSE),\"\")","v":"MO50"},{"$f":"SUM(LARGE((H311,J311,L311,N311,P311),{1,2,3,4,5}))","v":50.848708487084892},"",0,"",0,2.806944444444444,50.848708487084892,"",0,"",0,"",1,50.848708487084892]
[311,"Tim Petterson",{"$f":"IFERROR(VLOOKUP(B312,INDIRECT(\"'\"&$K$1&\"'!\"&\"$C$2:$H$400\"),2,FALSE),\"\")","v":"Pontyclun Road Runners"},{"$f":"IFERROR(VLOOKUP(B312,INDIRECT(\"'\"&$K$1&\"'!\"&\"$C$2:$H$400\"),3,FALSE),\"\")","v":"M"},{"$f":"IFERROR(VLOOKUP(B312,INDIRECT(\"'\"&$K$1&\"'!\"&\"$C$2:$H$400\"),4,FALSE),\"\")","v":"MO40"},{"$f":"SUM(LARGE((H312,J312,L312,N312,P312),{1,2,3,4,5}))","v":26.494464944649465},"",0,"",0,3.2652777777777775,26.494464944649465,"",0,"",0,"",1,26.494464944649465]
[312,"Tim Woodier",{"$f":"IFERROR(VLOOKUP(B313,INDIRECT(\"'\"&$M$1&\"'!\"&\"$C$2:$H$400\"),2,FALSE),\"\")","v":"Mynydd Du"},{"$f":"IFERROR(VLOOKUP(B313,INDIRECT(\"'\"&$M$1&\"'!\"&\"$C$2:$H$400\"),3,FALSE),\"\")","v":"M"},{"$f":"IFERROR(VLOOKUP(B313,INDIRECT(\"'\"&$M$1&\"'!\"&\"$C$2:$H$400\"),4,FALSE),\"\")","v":"MU40"},{"$f":"SUM(LARGE((H313,J313,L313,N313,P313),{1,2,3,4,5}))","v":97.049364849654296},"",0,"",0,"",0,2.9641203703703701E-2,97.049364849654296,"",0,"",1,97.049364849654296]
[313,"Tony Mackay",{"$f":"IFERROR(VLOOKUP(B314,INDIRECT(\"'\"&$K$1&\"'!\"&\"$C$2:$H$200\"),2,FALSE),\"\")","v":"Pegasus RC"},{"$f":"IFERROR(VLOOKUP(B314,INDIRECT(\"'\"&$K$1&\"'!\"&\"$C$2:$H$200\"),3,FALSE),\"\")","v":"M"},{"$f":"IFERROR(VLOOKUP(B314,INDIRECT(\"'\"&$K$1&\"'!\"&\"$C$2:$H$200\"),4,FALSE),\"\")","v":"MO50"},{"$f":"SUM(LARGE((H314,J314,L314,N314,P314),{1,2,3,4,5}))","v":68.08118081180811},"",0,"",0,2.4826388888888888,68.08118081180811,"",0,"",0,"",1,68.08118081180811]
[314,"Trystan Hopkin",{"$f":"IFERROR(VLOOKUP(B315,INDIRECT(\"'\"&$K$1&\"'!\"&\"$C$2:$H$400\"),2,FALSE),\"\")","v":"Unattached"},{"$f":"IFERROR(VLOOKUP(B315,INDIRECT(\"'\"&$K$1&\"'!\"&\"$C$2:$H$400\"),3,FALSE),\"\")","v":"M"},{"$f":"IFERROR(VLOOKUP(B315,INDIRECT(\"'\"&$K$1&\"'!\"&\"$C$2:$H$400\"),4,FALSE),\"\")","v":"MU40"},{"$f":"SUM(LARGE((H315,J315,L315,N315,P315),{1,2,3,4,5}))","v":40.110701107011067},"",0,"",0,3.0090277777777779,40.110701107011067,"",0,"",0,"",1,40.110701107011067]
[315,"Vanessa Turnbull",{"$f":"IFERROR(VLOOKUP(B316,INDIRECT(\"'\"&$K$1&\"'!\"&\"$C$2:$H$400\"),2,FALSE),\"\")","v":"Caerphilly Runners"},{"$f":"IFERROR(VLOOKUP(B316,INDIRECT(\"'\"&$K$1&\"'!\"&\"$C$2:$H$400\"),3,FALSE),\"\")","v":"F"},{"$f":"IFERROR(VLOOKUP(B316,INDIRECT(\"'\"&$K$1&\"'!\"&\"$C$2:$H$400\"),4,FALSE),\"\")","v":"FO50"},{"$f":"SUM(LARGE((H316,J316,L316,N316,P316),{1,2,3,4,5}))","v":35.977859778597796},"",0,"",0,3.0868055555555554,35.977859778597796,"",0,"",0,"",1,35.977859778597796]
[316,"Vicky Mead",{"$f":"IFERROR(VLOOKUP(B317,INDIRECT(\"'\"&$K$1&\"'!\"&\"$C$2:$H$400\"),2,FALSE),\"\")","v":"Pontyclun Road Runners"},{"$f":"IFERROR(VLOOKUP(B317,INDIRECT(\"'\"&$K$1&\"'!\"&\"$C$2:$H$400\"),3,FALSE),\"\")","v":"F"},{"$f":"IFERROR(VLOOKUP(B317,INDIRECT(\"'\"&$K$1&\"'!\"&\"$C$2:$H$400\"),4,FALSE),\"\")","v":"FO40"},{"$f":"SUM(LARGE((H317,J317,L317,N317,P317),{1,2,3,4,5}))","v":17.416974169741685},"",0,"",0,3.4361111111111113,17.416974169741685,"",0,"",0,"",1,17.416974169741685]
[317,"Wayne Beynon",{"$f":"IFERROR(VLOOKUP(B318,INDIRECT(\"'\"&$K$1&\"'!\"&\"$C$2:$H$200\"),2,FALSE),\"\")","v":"Unattached"},{"$f":"IFERROR(VLOOKUP(B318,INDIRECT(\"'\"&$K$1&\"'!\"&\"$C$2:$H$200\"),3,FALSE),\"\")","v":"M"},{"$f":"IFERROR(VLOOKUP(B318,INDIRECT(\"'\"&$K$1&\"'!\"&\"$C$2:$H$200\"),4,FALSE),\"\")","v":"MU40"},{"$f":"SUM(LARGE((H318,J318,L318,N318,P318),{1,2,3,4,5}))","v":81.586715867158659},"",0,"",0,2.2284722222222224,81.586715867158659,"",0,"",0,"",1,81.586715867158659]
[318,"Wendy Cheng",{"$f":"IFERROR(VLOOKUP(B319,INDIRECT(\"'\"&$K$1&\"'!\"&\"$C$2:$H$400\"),2,FALSE),\"\")","v":"Unattached"},{"$f":"IFERROR(VLOOKUP(B319,INDIRECT(\"'\"&$K$1&\"'!\"&\"$C$2:$H$400\"),3,FALSE),\"\")","v":"F"},{"$f":"IFERROR(VLOOKUP(B319,INDIRECT(\"'\"&$K$1&\"'!\"&\"$C$2:$H$400\"),4,FALSE),\"\")","v":"FO60"},{"$f":"SUM(LARGE((H319,J319,L319,N319,P319),{1,2,3,4,5}))","v":0},"",0,"",0,4.5888888888888895,0,"",0,"",0,"",1,0]
[319,"Wendy Holloway",{"$f":"IFERROR(VLOOKUP(B320,INDIRECT(\"'\"&$K$1&\"'!\"&\"$C$2:$H$400\"),2,FALSE),\"\")","v":"Unattached"},{"$f":"IFERROR(VLOOKUP(B320,INDIRECT(\"'\"&$K$1&\"'!\"&\"$C$2:$H$400\"),3,FALSE),\"\")","v":"F"},{"$f":"IFERROR(VLOOKUP(B320,INDIRECT(\"'\"&$K$1&\"'!\"&\"$C$2:$H$400\"),4,FALSE),\"\")","v":"FO40"},{"$f":"SUM(LARGE((H320,J320,L320,N320,P320),{1,2,3,4,5}))","v":17.12177121771219},"",0,"",0,3.4416666666666664,17.12177121771219,"",0,"",0,"",1,17.12177121771219]
[320,"William Powell",{"$f":"IFERROR(VLOOKUP(B321,INDIRECT(\"'\"&$K$1&\"'!\"&\"$C$2:$H$400\"),2,FALSE),\"\")","v":"Hendre Lake RC"},{"$f":"IFERROR(VLOOKUP(B321,INDIRECT(\"'\"&$K$1&\"'!\"&\"$C$2:$H$400\"),3,FALSE),\"\")","v":"M"},{"$f":"IFERROR(VLOOKUP(B321,INDIRECT(\"'\"&$K$1&\"'!\"&\"$C$2:$H$400\"),4,FALSE),\"\")","v":"MU40"},{"$f":"SUM(LARGE((H321,J321,L321,N321,P321),{1,2,3,4,5}))","v":30.442804428044301},"",0,"",0,3.1909722222222219,30.442804428044301,"",0,"",0,"",1,30.442804428044301]
[321,"Wyn Davies",{"$f":"IFERROR(VLOOKUP(B322,INDIRECT(\"'\"&$M$1&\"'!\"&\"$C$2:$H$400\"),2,FALSE),\"\")","v":"Mynydd Du"},{"$f":"IFERROR(VLOOKUP(B322,INDIRECT(\"'\"&$M$1&\"'!\"&\"$C$2:$H$400\"),3,FALSE),\"\")","v":"M"},{"$f":"IFERROR(VLOOKUP(B322,INDIRECT(\"'\"&$M$1&\"'!\"&\"$C$2:$H$400\"),4,FALSE),\"\")","v":"MO50"},{"$f":"SUM(LARGE((H322,J322,L322,N322,P322),{1,2,3,4,5}))","v":74.698504582730351},"",0,"",0,"",0,3.6076388888888887E-2,74.698504582730351,"",0,"",1,74.698504582730351]
[322,"Yvonne Williams",{"$f":"IFERROR(VLOOKUP(B323,INDIRECT(\"'\"&$K$1&\"'!\"&\"$C$2:$H$200\"),2,FALSE),\"\")","v":"Penarth & Dinas Runners"},{"$f":"IFERROR(VLOOKUP(B323,INDIRECT(\"'\"&$K$1&\"'!\"&\"$C$2:$H$200\"),3,FALSE),\"\")","v":"F"},{"$f":"IFERROR(VLOOKUP(B323,INDIRECT(\"'\"&$K$1&\"'!\"&\"$C$2:$H$200\"),4,FALSE),\"\")","v":"FO60"},{"$f":"SUM(LARGE((H323,J323,L323,N323,P323),{1,2,3,4,5}))","v":42.509225092250922},"",0,"",0,2.963888888888889,42.509225092250922,"",0,"",0,"",{"$f":"6-COUNTIF(G323:Q323,\"\")","v":1},{"$f":"F323/IF(R323>4,5,R323)","v":42.509225092250922}]
[323,"Zoe Proctor",{"$f":"IFERROR(VLOOKUP(B324,INDIRECT(\"'\"&$M$1&\"'!\"&\"$C$2:$H$400\"),2,FALSE),\"\")","v":"Mynydd Du"},{"$f":"IFERROR(VLOOKUP(B324,INDIRECT(\"'\"&$M$1&\"'!\"&\"$C$2:$H$400\"),3,FALSE),\"\")","v":"F"},{"$f":"IFERROR(VLOOKUP(B324,INDIRECT(\"'\"&$M$1&\"'!\"&\"$C$2:$H$400\"),4,FALSE),\"\")","v":"FU40"},{"$f":"SUM(LARGE((H324,J324,L324,N324,P324),{1,2,3,4,5}))","v":84.868949991960136},"",0,"",0,"",0,3.3148148148148149E-2,84.868949991960136,"",0,"",1,84.868949991960136]

{"sheet":"Blorenge Downhill","index":1,"n_rows":21,"n_cols":9,"rows_kept":21,"cut":false,"hidden":false,"merged":[]}
["Position","Number","Name","Club","Gender","Category","Time","Points",{"$f":"AVERAGE(G2:G6)","v":"00:15:30.800"}]
[1,223,"Matt Stott","MDC","M","MU40","00:14:16",{"$f":"(2-(G2/LLYNYFANTOP5))*100","v":108.03609798023204}]
[{"$f":"A2+1","v":2},221,"Chris Jones","MDC","M","MU40","00:14:17",107.92866351525569]
[3,220,"Paul Murrin","Chepstow Harriers","M","MO40","00:15:37",99.333906317146543]
[4,217,"Ed Dickson","MDC","M","MU40","00:16:38",92.780403953588333]
[5,225,"Martin Driscoll","MDC","M","MU40","00:16:46",91.920928233777403]
[6,216,"Helen Brown","Mynydd Du","F","FO40","00:17:00",90.416845724108285]
[7,214,"Paul Tucker","U/A","M","MO50","00:17:19",88.375590889557373]
[8,218,"Mark Burley","Bristol and West Athletics Club","M","MU40","00:17:43",85.797163730124623]
[9,233,"Steve Harrhy","Pontypool","M","MO50","00:18:09",83.003867640739145]
[10,227,"Jonathon Like","U/A","M","MU40","00:18:34",80.318006016330031]
[11,226,"Mark Buxton","MDC","M","MU40","00:19:22",75.161151697464561]
[12,229,"Andy Stott","MDC","M","M050","00:19:36",73.657069187795415]
[13,213,"Gary Gunner","Croft Ambrey","M","M070","00:19:50",72.152986678126354]
[14,231,"Sasha Habgood","MDC","F","FO40","00:20:40",66.781263429308126]
[15,222,"Meshari Alsaeed","MDC","M","MU23","00:21:36",60.76493339063169]
[16,215,"Rona Davies","Mynydd Du","F","FU40","00:21:42",60.120326600773531]
[17,224,"Katy Benson","MDC","F","FU40","00:22:01",58.079071766222597]
[18,230,"David Jenkins","Forest of Dean Athletics Club","M","MU40","00:22:16",56.467554791577143]
[19,232,"John Price","Hay Hotfooters","M","MO50","00:23:35",47.980232058444372]
[20,228,"Harriet Like","U/A","F","FO40","00:28:59",13.171465406102257]

{"sheet":"Blorenge Uphill","index":2,"n_rows":73,"n_cols":15,"rows_kept":73,"cut":false,"hidden":false,"merged":[]}
[null,"Number","Name","Club","Gender","Category","Time","Points",{"$f":"AVERAGE(G2:G6)","v":"00:29:49.800"}]
[1,223,"Matt Stott","MDC","M","MU40","00:28:13",{"$f":"(2-(G2/I$1))*100","v":105.40842552240477}]
[2,221,"Chris Jones","MDC","M","MU40","00:29:01",102.72656162699745]
[3,220,"Paul Murrin","Chepstow Harriers","M","MO40","00:28:23",104.84970387752823]
[4,219,"Tim Hindle","Brecon","M","MO40","00:31:00",96.077774052966802]
[5,218,"Mark Burley","Bristol and West Athletics Club","M","MU40","00:32:32",90.937534920102834]
[6,217,"Ed Dickson","MDC","M","MU40","00:32:59",89.428986478936224]
[7,225,"Martin Driscoll","MDC","M","MU40","00:33:30",{"$f":"(2-(G8/I$1))*100","v":87.696949379818975}]
[8,216,"Helen Brown","Mynydd Du","F","FO40","00:33:40",87.138227734942461]
[9,226,"Mark Buxton","MDC","M","MU40","00:35:41",80.377695831936563]
[10,214,"Paul Tucker","U/A","M","MO50","00:36:36",77.304726785115662]
[11,233,"Steve Harrhy","Pontypool","M","MO50","00:37:43",73.56129176444297]
[12,230,"David Jenkins","Forest of Dean Athletics Club","M","MU40","00:41:04",62.330986702424852]
[13,229,"Andy Stott","MDC","M","M050","00:43:17",54.899988825567128]
[14,224,"Katy Benson","MDC","F","FU40","00:45:37",47.077885797295792]
[15,222,"Meshari Alsaeed","MDC","M","MU23","00:46:23",44.507766230863808]
[]
[]
[]
[]
[]
[]
[]
[]
[]
[]
[]
[]
[]
[]
[]
[]
[]
[]
[]
[]
[]
[]
[]
[]
[]
[]
[]
[]
[]
[]
[]
[]
[]
[]
[]
[]
[]
[]
[]
[]
[]
[]
[]
[]
[]
[]
[]
[null,null,null,null,null,null,null,null,null,null,null,null,null,null,{"$f":"IF(#REF!=\"F\",D15,\" \")","v":{"$error":"#REF!"}}]
[null,null,null,null,null,null,null,null,null,null,null,null,null,null,"Sarah Tagg"]
[null,null,null,null,null,null,null,null,null,null,null,null,null,null,"Rebecca Darby"]
[null,null,null,null,null,null,null,null,null,null,null,null,null,null,"Kate Lock"]
[null,null,null,null,null,null,null,null,null,null,null,null,null,null,"Sarah Francis"]
[null,null,null,null,null,null,null,null,null,null,null,null,null,null,"Marcelle Mackay"]
[null,null,null,null,null,null,null,null,null,null,null,null,null,null,"Carolien Smit"]
[null,null,null,null,null,null,null,null,null,null,null,null,null,null,"Nicola Sinclair"]
[null,null,null,null,null,null,null,null,null,null,null,null,null,null,"Dawn Davis"]
[null,null,null,null,null,null,null,null,null,null,null,null,null,null,"Rowenna Harwar"]

{"sheet":"Pentyrch Hill Race","index":3,"n_rows":278,"n_cols":9,"rows_kept":278,"cut":false,"hidden":false,"merged":[]}
["Position","Number","Name","Club","Gender","Cat","Time","Points",{"$f":"AVERAGE(G2:G5)","v":1.8819444444444444}]
[1,10,"Daniel Bodman","Aberdare VAAC","M","MU40",1.846527777777778,{"$f":"(2-(G2/I$1))*100","v":101.88191881918817}]
[2,86,"Peter Ryder","Cardiff AAC","M","MU40",1.8576388888888891,{"$f":"(2-(G3/I$1))*100","v":101.29151291512915}]
[3,4,"Iwan Morton","MMRT","M","MU40",1.8854166666666667,99.81549815498154]
[4,310,"Oscar Partridge","Mynydd Du","M","MU40",1.9381944444444443,97.011070110701112]
[5,101,"Thomas Burden","Unattached","M","MU40",1.95,96.383763837638384]
[6,96,"Jack Brown","Unattached","M","MU40",1.9937500000000001,94.059040590405885]
[7,78,"Darren Bishop","Pontypridd Roadents","M","MU40",2.0006944444444446,93.690036900368995]
[8,57,"Paul Graham","Pontypridd Roadents","M","MU40",2.0368055555555555,91.771217712177105]
[9,45,"Alun Wood","Mynydd Du","M","MU40",2.0791666666666666,89.520295202952042]
[10,140,"Gareth Crossway","Unattached","M","MU40",2.0826388888888889,89.335793357933582]
[11,182,"Lee Mills","Islwyn RC","M","MU40",2.088888888888889,89.003690036900366]
[12,181,"Dafydd Lambeth","Islwyn RC","M","MO40",2.1069444444444447,88.044280442804407]
[13,154,"Peter Coles","Pontypridd Roadents","M","MO50",2.125,87.084870848708491]
[14,58,"Clara Evans","Pontypridd Roadents","F","FU40",2.1305555555555555,86.789667896678964]
[15,7,"Owen Morris","Unattached","M","MU40",2.1381944444444447,86.383763837638355]
[16,275,"Philip Williams","Pontypridd Roadents","M","MU40",2.15,85.756457564575641]
[17,28,"Rob Sage","Les Croupiers RC","M","MU40",2.1541666666666668,85.535055350553506]
[18,188,"Andrew Jones","Unattached","M","MO40",2.1729166666666666,84.538745387453872]
[19,136,"Tim Hindle","Brecon","M","MO40",2.1750000000000003,84.428044280442791]
[20,79,"Neil Jones","Pontyclun Road Runners","M","MU40",2.1840277777777777,83.948339483394847]
[21,148,"Oliver Burrows","Unattached","M","MU40",2.1958333333333333,83.321033210332104]
[22,143,"Richard Jackson-Hookins","Penarth & Dinas Runners","M","MU40",2.1979166666666665,83.210332103321051]
[23,137,"Gethin Powell","White Rock Runners","M","MU40",2.1986111111111111,83.173431734317347]
[24,130,"Anthony Bannon","San Domenico RC","M","MU40",2.2006944444444447,83.062730627306252]
[25,274,"Karl James","Neath Harriers","M","MO50",2.2069444444444444,82.730627306273078]
[26,297,"Dave Buchanan","San Domenico RC","M","MU40",2.2131944444444445,82.398523985239862]
[27,157,"Malcom O'Brien","Unattached","M","MU40",2.2145833333333331,82.324723247232484]
[28,296,"Wayne Beynon","Unattached","M","MU40",2.2284722222222224,81.586715867158659]
[29,18,"John Aggleton","Mynyddwyr de Cymru","M","MO60",2.2388888888888889,81.033210332103309]
[30,266,"Simon Thomas","San Domenico RC","M","MO40",2.2493055555555554,80.479704797047987]
[31,34,"Ian Macklin","Mynyddwyr de Cymru","M","MO40",2.2562500000000001,80.110701107011067]
[32,196,"Rhodri Evans","Pontypridd Roadents","M","MO40",2.2590277777777779,79.963099630996311]
[33,139,"Matthew Forde","Unattached","M","MU40",2.2611111111111111,79.852398523985244]
[34,38,"Mark Buxton","Mynyddwyr de Cymru","M","MU40",2.2624999999999997,79.778597785977865]
[35,100,"Jamie Clode","Bridgend AC","M","MU40",2.2645833333333334,79.667896678966784]
[36,52,"Peter Turnbull","Les Croupiers RC","M","MO50",2.2673611111111112,79.520295202952028]
[37,175,"Patrick Lees","Cardiff Triathletes","M","MU40",2.2708333333333335,79.335793357933568]
[38,189,"Richard Self","Les Croupiers RC","M","MO50",2.2798611111111113,78.856088560885595]
[39,127,"Daniel Thrift","Unattached","M","MU40",2.2805555555555554,78.819188191881921]
[40,107,"Andy Jones","Penarth & Dinas Runners","M","MU40",2.28125,78.782287822878217]
[41,35,"Richard Cronin","Mynyddwyr de Cymru","M","MU40",2.2868055555555555,78.487084870848705]
[42,49,"Katie Roby","Mynyddwyr de Cymru","F","FU40",2.2965277777777779,77.970479704797043]
[43,183,"Paul Hayward","Islwyn RC","M","MU40",2.2993055555555553,77.822878228782315]
[44,144,"Gareth Huw Griffiths","Unattached","M","MO40",2.3020833333333335,77.675276752767502]
[45,249,"Mark Saunders","Mynyddwyr de Cymru","M","MO50",2.307638888888889,77.380073800737989]
[46,298,"Ceri Davies","San Domenico RC","M","MO40",2.3159722222222223,76.93726937269372]
[47,27,"Elio Lepore","Les Croupiers RC","M","MO60",2.3333333333333335,76.014760147601464]
[48,323,"Paul Chester","WFRA","M","MO40",2.3395833333333331,75.682656826568277]
[49,3,"Darren Jones","Cardiff Harlequins","M","MU40",2.35,75.129151291512926]
[50,129,"Liam Osborne","Pontypridd Roadents","M","MU40",2.3673611111111112,74.206642066420642]
[51,60,"Niki Morgan","Chepstow Harriers","F","FO40",2.3729166666666668,73.911439114391129]
[52,106,"Mark Durkin","Penarth & Dinas Runners","M","MU40",2.3743055555555554,73.837638376383779]
[53,290,"Andrew Evans","Unattached","M","MO40",2.3756944444444446,73.763837638376373]
[54,269,"Andrew Dickens","Mynydd Du","M","MO40",2.3784722222222223,73.616236162361616]
[55,198,"Lee McMeeking","Unattached","M","MO40",2.3861111111111111,73.210332103321036]
[56,89,"Ian Ogilvie","Brackla Harriers","M","MO40",2.3958333333333335,72.693726937269361]
[57,190,"Richard Jones","Unattached","M","MU40",2.3986111111111112,72.546125461254604]
[58,267,"David Morris","Unattached","M","MU40",2.4027777777777777,72.32472324723247]
[59,259,"Laura Tinwell","Pontypridd Roadents","F","FU40",2.4055555555555554,72.177121771217713]
[60,262,"Gary Davies","Mynyddwyr de Cymru","M","MU40",2.4076388888888887,72.06642066420666]
[61,248,"Oliver Lamford","Mynyddwyr de Cymru","M","MU40",2.4104166666666669,71.918819188191875]
[62,281,"Glyn Sansom","San Domenico RC","M","MO50",2.4125000000000001,71.808118081180822]
[63,161,"Geraint Jenkins","Port Talbot Harriers","M","MO40",2.4166666666666665,71.586715867158674]
[64,176,"Nick Denny","Pontypridd Roadents","M","MU40",2.4194444444444447,71.439114391143903]
[65,270,"Lou Summers","Mynydd Du","F","FO40",2.4243055555555553,{"$f":"(2-(G66/I$1))*100","v":71.180811808118108}]
[66,170,"Alec Care","San Domenico RC","M","MU40",2.4361111111111113,70.553505535055322]
[67,87,"Huw Pullen","Unattached","M","MU40",2.4375,70.479704797047972]
[68,97,"David Beard","Unattached","M","MU40",2.4416666666666669,70.258302583025809]
[69,66,"Neil Grant","Chepstow Harriers","M","MO60",2.4444444444444442,70.110701107011081]
[70,122,"Carl Edwards","Pontypridd Roadents","M","MO40",2.4499999999999997,69.815498154981555]
[71,171,"Matthew Hooper","Les Croupiers RC","M","MU40",2.4513888888888888,69.741697416974176]
[72,99,"Natalie Taylor","Mynydd Du","F","FU40",2.4527777777777779,69.667896678966784]
[73,158,"Sean McNally","Unattached","M","MU40",2.4548611111111112,69.557195571955717]
[74,30,"Elaine Ferguson","Pontypridd Roadents","F","FU40",2.4569444444444444,69.446494464944635]
[75,77,"Jamie Bishop","Pontypridd Roadents","M","MU40",2.4624999999999999,69.151291512915122]
[76,309,"Simon Slinn","Unattached","M","MU40",2.4666666666666668,68.929889298892988]
[77,147,"Rob McAllister","Unattached","M","MU40",2.4770833333333333,68.376383763837637]
[78,75,"Tony Mackay","Pegasus RC","M","MO50",2.4826388888888888,68.08118081180811]
[79,1,"Nick Harris","Cwm Ogwr RC","M","MU40",2.4833333333333334,68.044280442804421]
[80,51,"Robert Wilson","Penarth & Dinas Runners","M","MO50",2.4888888888888889,67.749077490774894]
[81,277,"David Underhill","Unattached","M","MU40",2.4909722222222221,67.638376383763841]
[82,110,"David Harden","Unattached","M","MU40",2.4965277777777777,67.343173431734328]
[83,151,"Matthew Lynch","Unattached","M","MO40",2.5034722222222223,66.974169741697409]
[84,131,"Nigel Graham","Unattached","M","MO40",2.5138888888888888,66.420664206642073]
[85,263,"John Magee","Les Croupiers RC","M","MO40",2.5180555555555553,66.199261992619938]
[86,40,"Howard Kent","Les Croupiers RC","M","MO60",2.5194444444444444,66.125461254612532]
[87,71,"Paul Thomas","Islwyn RC","M","MO40",2.5222222222222221,65.977859778597775]
[88,250,"Alice Bedwell","Mynyddwyr de Cymru","F","FO50",2.5291666666666668,65.608856088560884]
[89,174,"Stephen May","Pontypridd Roadents","M","MO40",2.5326388888888887,65.424354243542453]
[90,305,"Kerry Galey","Unattached","M","MO50",2.5340277777777778,65.350553505535046]
[91,6,"Stephen Owen","Chepstow Harriers","M","MO60",2.5375000000000001,65.166051660516587]
[92,70,"Nick Young","Cardiff Tri","M","MU40",2.5402777777777779,65.01845018450183]
[93,69,"Hefin Gruffydd","Pontypridd Roadents","M","MO50",2.5409722222222224,64.981549815498155]
[94,253,"Richard Howells","Unattached","M","MU40",2.5409722222222224,64.981549815498155]
[95,9,"Richard D Jones","Unattached","M","MO40",2.5416666666666665,64.944649446494481]
[96,134,"Stewart Harding","CDF Runners","M","MU40",2.5444444444444447,64.797047970479696]
[97,180,"Craig Smith","Pegasus RC","M","MU40",2.5479166666666666,64.61254612546125]
[98,"XX","Unknown athlete","Not recorded",null,{"$error":"#N/A"},2.5500000000000003,64.501845018450183]
[99,32,"Cath Tailby","Penarth & Dinas Runners","F","FO40",2.5520833333333335,64.391143911439102]
[100,304,"Peter Llewellyn","Unattached","M","MU40",2.5555555555555558,64.206642066420642]
[101,109,"Gareth Jones","Mynyddwyr de Cymru","M","MO60",2.5583333333333331,64.0590405904059]
[102,260,"Harry Row","Unattached","M","MU40",2.5611111111111113,63.911439114391122]
[103,65,"Rhys Griffiths","Hendre Lake RC","M","MU40",2.5618055555555554,63.874538745387468]
[104,98,"Patrick Keating","Unattached","M","MU40",2.5638888888888887,63.763837638376387]
[105,247,"Paul Harvey","Pontypool","M","MU40",2.5645833333333332,63.726937269372705]
[106,162,"Ian Leaves","Unattached","M","MO40",2.5666666666666669,63.616236162361602]
[107,11,"Sally Lock","Unattached","F","FU40",2.5736111111111111,63.247232472324733]
[108,150,"Glenn Powell","Penarth & Dinas Runners","M","MU40",2.588888888888889,62.435424354243537]
[109,184,"David Cornish","Port Talbot Harriers","M","MO50",2.6055555555555556,61.54981549815497]
[110,291,"Gina Hardman","Bridgend AC","F","FO40",2.6104166666666666,61.291512915129154]
[111,123,"Jan Edwards","Pontypridd Roadents","F","FO40",2.6152777777777776,61.033210332103337]
[112,125,"Richard Bowie","Fairwater Runners","M","MO50",2.6208333333333331,60.738007380073796]
[113,17,"John Kerley","AS Chamonix","M","MO60",2.625,60.516605166051662]
[114,292,"Jessica Ellis","Les Croupiers RC","F","FU40",2.6256944444444446,60.479704797047958]
[115,276,"Robert Haley","Unattached","M","MU40",2.6277777777777778,60.369003690036905]
[116,111,"Pat Westlake","Unattached","M","MO50",2.6291666666666669,60.295202952029506]
[117,317,"Jeremy Theobald","Cardiff Tri","M","MU40",2.6361111111111111,59.926199261992629]
[118,"XX","Unknown athlete","Not recorded",null,{"$error":"#N/A"},2.6361111111111111,59.926199261992629]
[119,"XX","Unknown athlete","Not recorded",null,{"$error":"#N/A"},2.6388888888888888,59.778597785977851]
[120,"XX","Unknown athlete","Not recorded",null,{"$error":"#N/A"},2.6402777777777779,59.704797047970473]
[121,22,"Anna Lewis","Unattached","F","FU40",2.6430555555555553,59.557195571955731]
[122,169,"Ian Bell","San Domenico RC","M","MO50",2.6527777777777777,59.040590405904055]
[123,312,"Paul Gilsen","Unattached","M","MU40",2.6604166666666669,58.634686346863461]
[124,314,"Will Owens?","Unattached","M","MU40",2.6618055555555555,58.560885608856083]
[125,286,"Jeanette Jenkins","Fairwater Runners","F","FO50",2.6625000000000001,58.523985239852379]
[126,33,"Roy Silver","Les Croupiers RC","M","MO50",2.6659722222222224,58.339483394833948]
[127,108,"Karen Elvers","Mynyddwyr de Cymru","F","FO40",2.6715277777777775,58.044280442804428]
[128,67,"Martin Slucutt","Swansea Harriers","M","MU40",2.6722222222222225,{"$f":"(2-(G129/I$1))*100","v":58.007380073800732}]
[129,124,"John Carroll","Roberttown Runners","M","MO50",2.6729166666666671,57.970479704797029]
[130,197,"Liz Merrifield","Unattached","F","FU40",2.6736111111111112,57.933579335793354]
[131,271,"Steven Burnett","Unattached","M","MU40",2.6743055555555557,57.896678966789651]
[132,90,"Judith Oakley","Vegan Runners","F","FO50",2.6750000000000003,57.859778597785969]
[133,141,"Stuart Davies","South Wales Police Tri","M","MO40",2.6798611111111108,57.601476014760152]
[134,272,"Ruth Deards","Les Croupiers RC","F","FO40",2.6888888888888887,57.12177121771218]
[135,177,"Martin Gebbett","Horstorth Fellindale","M","MO50",2.6937500000000001,56.863468634686342]
[136,172,"Linda Woodland","Port Talbot Harriers","F","FO50",2.6972222222222224,56.678966789667882]
[137,13,"Glyn Drucker","Caerphilly Runners","M","MO40",2.7055555555555557,56.236162361623613]
[138,155,"Dewi Gwynedd","Unattached","M","MO40",2.7069444444444444,56.162361623616228]
[139,278,"Kat Hunter","Unattached","F","FU40",2.713888888888889,55.793357933579337]
[140,16,"Dave Mathews","Penarth & Dinas Runners","M","MU40",2.7201388888888887,55.461254612546142]
[141,264,"Bob Ford","Pontypridd Roadents","M","MO60",2.7229166666666664,55.313653136531386]
[142,268,"Jonathan Morris","Unattached","M","MU40",2.7270833333333333,55.092250922509223]
[143,252,"Kris Powell","Unattached","F","FU40",2.7312499999999997,54.870848708487109]
[144,311,"Nicholas Pounder","Pontypridd Roadents","M","MO40",2.7375000000000003,54.538745387453872]
[145,63,"Aisling Pigott","Outdoor Fitness","F","FU40",2.7402777777777776,54.39114391143913]
[146,200,"Neill Parker","Islwyn RC","M","MO40",2.7416666666666667,54.31734317343173]
[147,285,"Martyn Jenkins","Fairwater Runners","M","MO50",2.7486111111111113,53.948339483394811]
[148,119,"Adrian Gwilliam","Fairwater Runners","M","MO50",2.7527777777777778,53.726937269372698]
[149,142,"Neil Coleman","Unattached","M","MO50",2.7666666666666671,52.988929889298866]
[150,288,"Dean McNeil-Jones","Unattached","M","MO40",2.775694444444444,52.509225092250929]
[151,287,"Andrew Ramsey","Caerphilly Runners","M","MU40",2.7791666666666668,52.324723247232477]
[152,159,"Tim Buckley","Chepstow Harriers","M","MO40",2.7847222222222219,52.029520295202957]
[153,282,"Karen Hackwell","Unattached","F","FO40",2.7875000000000001,51.881918819188179]
[154,251,"Daniel Morgan","Bridgend AC","M","MU40",2.7951388888888888,51.476014760147606]
[155,165,"Lisa Cleary","Penarth & Dinas Runners","F","FO50",2.8048611111111108,50.959409594095952]
[156,289,"Rachel Garside","Unattached","F","FO40",2.8062499999999999,50.885608856088574]
[157,133,"Tim O'Sullivan","Les Croupiers RC","M","MO50",2.806944444444444,50.848708487084892]
[158,121,"Peter Dorrington","Unattached","M","MU40",2.818055555555556,50.258302583025817]
[159,114,"Stephen Paskell","Pontyclun Road Runners","M","MO40",2.8187500000000001,50.221402214022135]
[160,194,"Gwyn Jones","Les Croupiers RC","M","MO50",2.8187500000000001,50.221402214022135]
[161,50,"Neil Cook","Unattached","M","MO40",2.8222222222222224,50.036900369003675]
[162,36,"Andrew Palmer","Penarth & Dinas Runners","M","MO40",2.8229166666666665,50]
[163,146,"Jon Griffiths","Village Vipers","M","MO40",2.8277777777777775,49.741697416974183]
[164,273,"Haydn Griffiths","Mynyddwyr de Cymru","M","MO50",2.8319444444444444,49.520295202952028]
[165,261,"Emma Battensby","Unattached","F","FU40",2.8340277777777776,49.409594095940967]
[166,39,"Elaine Wharmby","Pegasus RC","F","FO50",2.8374999999999999,49.225092250922508]
[167,308,"Adrian Eggleton","Unattached","M","MO40",2.8506944444444446,48.523985239852394]
[168,88,"Julie Scholey","Les Croupiers RC","F","FO50",2.8576388888888888,48.154981549815503]
[169,258,"Hywel Williams","Caerphilly Runners","M","MU40",2.8659722222222221,47.712177121771226]
[170,179,"Stephen Wood","Pegasus RC","M","MU40",2.8666666666666667,47.675276752767523]
[171,48,"Joyce Dodd","Chepstow Harriers","F","F060",2.8687499999999999,47.56457564575647]
[172,315,"Jenni Bell","Chepstow Harriers","F","FO40",2.8819444444444446,46.863468634686335]
[173,14,"Andrew Oliver","Chepstow Harriers","M","MO40",2.8840277777777779,46.752767527675275]
[174,116,"Tim Gibbs","Unattached","M","MU40",2.8847222222222224,46.715867158671578]
[175,115,"Martin Charles","Pontyclun Road Runners","M","MU40",2.8868055555555556,46.605166051660518]
[176,163,"Paula Allen","Pegasus RC","F","FO40",2.8874999999999997,46.568265682656843]
[177,187,"Chris Chambost","Pontyclun Road Runners","M","MU40",2.8888888888888888,46.494464944649437]
[178,302,"Heidi Thomas","Unattached","F","FU40",2.8895833333333329,46.457564575645783]
[179,152,"Kevin Fowler","Pegasus RC","M","MO50",2.8972222222222221,46.051660516605168]
[180,199,"David E Williams","Les Croupiers RC","M","MO50",2.8979166666666667,46.014760147601464]
[181,195,"Jane Ash","Les Croupiers RC","F","FO40",2.9041666666666668,45.682656826568248]
[182,185,"Caroline Dallimore","Les Croupiers RC","F","FO60",2.9097222222222219,45.38745387453875]
[183,301,"Kevin Duncan","Unattached","M","MU40",2.9229166666666671,44.686346863468614]
[184,24,"Steve Hill","Penarth & Dinas Runners","M","MO50",2.9270833333333335,44.46494464944648]
[185,303,"Neil Stephens","Unattached","M","MU40",2.9312499999999999,44.243542435424366]
[186,68,"Beth Lewis","Les Croupiers RC","F","FU40",2.9333333333333336,44.132841328413264]
[187,29,"Matt Robertson","Penarth & Dinas Runners","M","MU40",2.9354166666666668,44.022140221402204]
[188,102,"Rebecca Brumbill","Pontyclun Road Runners","F","FU40",2.9465277777777779,43.431734317343171]
[189,55,"Sara Macbride-Stewart","Unattached","F","FO40",2.9520833333333329,43.136531365313679]
[190,316,"Kim Carwardine","Chepstow Harriers","F","FU40",2.9590277777777776,{"$f":"(2-(G191/I$1))*100","v":42.76752767527676}]
[191,72,"Gavin Simon","Unattached","M","MU40",2.9611111111111108,42.656826568265707]
[192,164,"Yvonne Williams","Penarth & Dinas Runners","F","FO60",2.963888888888889,42.509225092250922]
[193,193,"Gwen Richards","Pontypridd Roadents","F","FU23",2.9645833333333336,42.472324723247226]
[194,84,"Chris Purdon","Unattached","M","MO50",2.9722222222222219,42.066420664206646]
[195,64,"Christine Farr","SWOC","F","FO40",2.9798611111111111,41.660516605166052]
[196,283,"Peter Jenkins","Unattached","M","MU40",2.9861111111111112,41.328413284132836]
[197,160,"Jen Danger Harding","Chepstow Harriers","F","FU40",2.9923611111111108,40.996309963099641]
[198,31,"Chris Selby","San Domenico RC","M","MO40",2.9958333333333336,40.81180811808116]
[199,319,"Abigail Foulkes","Unattached","F","FU40",2.9958333333333336,40.81180811808116]
[200,156,"Alan Roberts","Port Talbot Harriers","M","MO60",2.9979166666666668,40.701107011070107]
[201,56,"Andrew Isaac","Unattached","M","MO50",2.9986111111111113,40.664206642066404]
[202,43,"Steve Terry","Unattached","M","MO40",2.9986111111111113,40.664206642066404]
[203,126,"Jonathan Parkes","Unattached","M","MU40",3.0041666666666664,40.369003690036905]
[204,313,"Charlotte Goodwin","Unattached","F","FU40",3.005555555555556,40.295202952029484]
[205,118,"Jonathan Mead","Pontyclun Road Runners","M","MO50",3.0062500000000001,40.258302583025831]
[206,61,"Trystan Hopkin","Unattached","M","MU40",3.0090277777777779,40.110701107011067]
[207,20,"Christopher Shorrock","Unattached","M","MO40",3.0243055555555554,39.2988929889299]
[208,41,"Rhian Durham","Pontypridd Roadents","F","FU40",3.0291666666666668,39.040590405904041]
[209,167,"Ben Gooding","Pegasus RC","M","MU40",3.03125,38.929889298892981]
[210,168,"Emma Bissex","Pegasus RC","F","FU40",3.0319444444444446,38.892988929889285]
[211,145,"Stephen Quin","Les Croupiers RC","M","MO40",3.036805555555556,38.634686346863447]
[212,105,"Anne Follan","Roberttown Runners","F","FO40",3.0500000000000003,37.933579335793333]
[213,46,"Katie Mortimer-Jones","Pontyclun Road Runners","F","FU40",3.0506944444444444,37.896678966789679]
[214,8,"Laura Jones","Unattached","F","FO40",3.0555555555555554,37.638376383763841]
[215,21,"Christie Coleman","Cwm Ogwr RC","M","MO40",3.056944444444444,37.564575645756484]
[216,53,"Paul Edwards","Cardiff AAC","M","MO40",3.0694444444444446,36.900369003690024]
[217,255,"Rebecca Christy","Unattached","F","FU40",3.0708333333333333,36.826568265682646]
[218,81,"Gareth Jones","Pontyclun Road Runners","M","MU40",3.0722222222222224,36.752767527675267]
[219,26,"Jon Reynolds","Unattached","M","MU40",3.0749999999999997,36.605166051660532]
[220,153,"Sian Khalil","Pontypridd Roadents","F","FO40",3.0819444444444444,36.236162361623613]
[221,103,"Carrie Perry","Roberttown Runners","F","FO40",3.0847222222222221,36.088560885608857]
[222,294,"Fiona Drysdale","Cwm Ogwr RC","F","FO40",3.0868055555555554,35.977859778597796]
[223,293,"Vanessa Turnbull","Caerphilly Runners","F","FO50",3.0868055555555554,35.977859778597796]
[224,104,"Natalee Murphy","Roberttown Runners","F","FU40",3.0916666666666668,35.719557195571937]
[225,5,"Glyn Hicks","Islwyn RC","M","MO60",3.0916666666666668,35.719557195571937]
[226,83,"Jeff Davies","Unattached","M","MO50",3.098611111111111,35.350553505535068]
[227,82,"Emma Chivers","Unattached","F","FO40",3.098611111111111,35.350553505535068]
[228,265,"Charlotte Barlow","Brackla Harriers","F","FU40",3.1111111111111112,34.686346863468628]
[229,149,"Sophie Gott","Hendre Lake RC","F","FU40",3.1145833333333335,34.501845018450169]
[230,2,"Dewi Hughes","Unattached","M","MO60",3.1458333333333335,32.841328413284131]
[231,19,"Ian James","Unattached","M","MU40",3.1458333333333335,32.841328413284131]
[232,54,"Jemma Nurse","Les Croupiers RC","F","FO40",3.1534722222222222,32.435424354243537]
[233,320,"Lowri Roberts","Les Croupiers RC","F","FO40",3.1597222222222219,32.103321033210342]
[234,295,"Nathan Jones","Pontypridd Roadents","M","MU40",3.1763888888888889,31.217712177121768]
[235,12,"Simon Watts","Unattached","M","MU40",3.182638888888889,30.885608856088552]
[236,318,"William Powell","Hendre Lake RC","M","MU40",3.1909722222222219,30.442804428044301]
[237,166,"John Ayres","Port Talbot Harriers","M","MO60",3.1993055555555556,30.000000000000004]
[238,128,"Penny Aubrey","Unattached","F","FU40",3.2034722222222225,29.778597785977844]
[239,138,"Joanne Lombardi","Unattached","F","FU40",3.2076388888888889,29.55719557195571]
[240,322,"Anna Helsing","Penarth & Dinas Runners","F","FO50",3.2124999999999999,29.298892988929893]
[241,120,"Giulia Teso","Unattached","F","FU40",3.213888888888889,29.22509225092249]
[242,47,"Lucy McCobb","Pontyclun Road Runners","F","FO40",3.2152777777777781,29.151291512915112]
[243,15,"Graeme Donnan","Les Croupiers RC","M","MO60",3.2277777777777779,28.487084870848701]
[244,76,"John Payne","Unattached","M","MO50",3.2368055555555557,28.007380073800725]
[245,23,"Tim Petterson","Pontyclun Road Runners","M","MO40",3.2652777777777775,26.494464944649465]
[246,91,"Ray James","Port Talbot Harriers","M","MO50",3.2708333333333335,26.199261992619927]
[247,44,"Mike Jones","Unattached","M","MO40",3.2749999999999999,25.977859778597789]
[248,192,"Nicola Bowman","Unattached","F","FO40",3.275694444444444,25.940959409594111]
[249,254,"Fiona Hillen","Unattached","F","FU40",3.3041666666666667,24.428044280442805]
[250,257,"Jen Williams","Caerphilly Runners","F","FU40",3.3430555555555554,22.361623616236169]
[251,256,"Michaela John","Unattached","F","FO40",3.3430555555555554,22.361623616236169]
[252,74,"Jenna Groves","Pegasus RC","F","FU40",3.3534722222222224,21.808118081180794]
[253,73,"Hugh Morgan","Eryri Harriers","M","MO40",3.3541666666666665,{"$f":"(2-(G254/I$1))*100","v":21.771217712177137}]
[254,307,"Sarah Evans ","San Domenico RC","F","FO40",3.3687499999999999,20.996309963099623]
[255,80,"James Harris","Pontyclun Road Runners","M","MU40",3.370138888888889,20.922509225092245]
[256,25,"Michelle Hoey","Penarth & Dinas Runners","F","FU40",3.370138888888889,20.922509225092245]
[257,284,"Ruth Owens","Penarth & Dinas Runners","F","FU40",3.3708333333333336,20.885608856088545]
[258,306,"Nicola Tonge","Unattached","F","FO40",3.4187499999999997,18.339483394833955]
[259,186,"Liz Stead","Unattached","F","FO50",3.4201388888888888,18.265682656826577]
[260,85,"Matthew Harris","Pontyclun Road Runners","M","MO50",3.4361111111111113,17.416974169741685]
[261,117,"Vicky Mead","Pontyclun Road Runners","F","FO40",3.4361111111111113,17.416974169741685]
[262,280,"Pat Searle","Unattached","F","FO50",3.4402777777777778,17.195571955719547]
[263,279,"Wendy Holloway","Unattached","F","FO40",3.4416666666666664,17.12177121771219]
[264,132,"Chris Todd Jones","Roberttown Runners","M","MO60",3.6062499999999997,8.3763837638376479]
[265,95,"Nia Kirk","Unattached","F","FU40",3.6152777777777776,7.896678966789672]
[266,94,"Kelly-Ann Allen","Port Talbot Harriers","F","FU40",3.6159722222222221,7.8597785977859713]
[267,135,"Kristina Salmone","CDF Runners","F","FU40",3.6395833333333329,6.6051660516605271]
[268,299,"Suzanne Fancourt","Unattached","F","FU40",3.7284722222222224,1.8819188191881775]
[269,300,"Sian Taylor","Unattached","F","FU40",3.7291666666666665,1.8450184501844991]
[270,59,"Dave Andrews","Chepstow Harriers","M","MO60",3.786805555555556,0]
[271,37,"Ian Kognetho","Chepstow Harriers","M","MO50",3.8000000000000003,0]
[272,92,"Richard Crook","Unattached","M","MO40",3.8680555555555554,0]
[273,93,"Jane Llewellyn","Unattached","F","FO50",3.8680555555555554,0]
[274,321,"Beata Jakubvak","Unattached","F","FO40",4.0034722222222223,0]
[275,112,"Daphne Austerberry","Chepstow Harriers","F","FO60",4.5791666666666666,0]
[276,113,"Wendy Cheng","Unattached","F","FO60",4.5888888888888895,0]
[null,"xx","Unknown athlete","Not entered",null,"N/A",3.0944444444444446,35.571955719557181]

{"sheet":"Mynydd Pen Y Fal","index":4,"n_rows":47,"n_cols":9,"rows_kept":47,"cut":false,"hidden":false,"merged":[]}
["Position","Number","Name","Club","Gender","Category","Time","Points",{"$f":"AVERAGE(G2:G6)","v":"00:41:27.600"}]
[1,31,"Iwan Morton","MMRT","M","MU40","00:41:13",{"$f":"(2-(G2/I$1))*100","v":100.58691107895159}]
[2,9,"Ian Macklin","MDC","M","M040","00:41:17",{"$f":"(2-(G3/I$1))*100","v":100.42611352307445}]
[3,10,"Oscar Partridge","Mynydd Du","M","MU40","00:41:25",100.10451841132016]
[4,29,"Matt Stott","MDC ","M","MU40","00:41:39",99.541726965750115]
[5,18,"John Aggleton","MDC","M","MO60","00:41:44",99.340730020903663]
[6,30,"Matthew Lawson","Chepstow Harriers","M","MO40","00:41:47",99.220131853995824]
[7,12,"Ricahrd Cronin","MDC","M","MU40","00:42:36",97.250361794500705]
[8,38,"Tim Woodier","Mynydd Du","M","MU40","00:42:41",97.049364849654296]
[9,23,"Oliver Lamford","MDC","M","MU40","00:43:13",95.762984402637059]
[10,28,"Jason King","LMRT","M","M040","00:43:15",95.682585624698518]
[11,27,"Mike Fawcett","LMRT","M","MO40","00:43:20",95.481588679852081]
[12,47,"Gary Davies","MDC","M","MU40","00:43:28",95.159993568097761]
[13,32,"Dan Sandford","Forest of Dean AC","M","MO40","00:43:45",94.476603955619879]
[14,5,"Andy Creber","Chepstow Harriers","M","MO50","00:43:51",94.235407621804157]
[15,1,"Julian Boon","Forest of Dean AC","M","MO40","00:43:59",93.913812510049837]
[16,8,"Paul Tucker","U/A","M","MO50","00:44:04",93.712815565203414]
[17,11,"James Woodier","Mynydd Du","M","MU40","00:44:13",93.351021064479809]
[18,43,"Andrew Dickens","Mynydd Du","M","MO40","00:44:18",93.1500241196334]
[19,17,"Emma Bayliss","Mynydd Du","F","FU40","00:45:09",91.099855282199727]
[20,36,"Roger Milss","Mynydd Du/Vegan Runners","M","MO40","00:45:23",90.53706383662967]
[21,33,"Mark Matthews","Forest of Dean AC","M","MO40","00:45:33",90.13506994693681]
[22,25,"Daniel Morgan","Bridgend AC","M","MU40","00:46:03",88.929088277858199]
[23,41,"Justin Ross","Mynydd Du","M","MU40","00:46:12",88.567293777134594]
[24,15,"Rona Davies","Mynydd Du","F","FO50","00:46:34",87.682907219810247]
[25,44,"Jamie Clode","Bridgend AC","M","MU40","00:47:03",86.517124939700935]
[26,16,"Hywel James","U/A","M","MU40","00:47:12",86.155330438977316]
[27,26,"Jon Thiel","Bridgend AC","M","MU40","00:47:27",85.552339604438004]
[28,42,"Lou Summers","Mynydd Du","F","FO40","00:47:32",85.351342659591566]
[29,46,"Thomas M","Mynydd Du","M","MU40","00:47:33",85.311143270622281]
[30,40,"Zoe Proctor","Mynydd Du","F","FU40","00:47:44",84.868949991960136]
[31,6,"Gareth Watkins","MDC","M","MO60","00:48:41",82.57758482071074]
[32,19,"Andy Stott","MDC","M","MO50","00:50:29",78.236050812027642]
[33,14,"Ben Watkins","Mynydd Du","M","MU40","00:50:40",77.793857533365497]
[34,45,"David Jenkins","Forest of Dean AC","M","MU40","00:51:13",76.467277697379004]
[35,21,"Peter Havard","MDC","M","MO60","00:51:29",75.824087473870392]
[36,3,"John Price","Hay Hotfooters","M","MO50","00:51:40",75.381894195208247]
[37,39,"Wyn Davies","Mynydd Du","M","MO50","00:51:57",74.698504582730351]
[38,7,"Karen Elvers","MDC","F","FO40","00:52:14",74.015114970252455]
[39,20,"Fraser Stephens","SWOC","M","MO40","00:52:24",73.61312108055958]
[40,34,"Paul Cahill","U/A","M","MU40","00:53:52",70.07557485126226]
[41,13,"Jan Richards","Mynydd Du","F","FO50","00:59:25",56.689178324489497]
[42,22,"Gemma O'Brien","U/A","F","FU40","00:59:58",55.362598488502982]
[43,24,"Kevin Hale","Bridgend AC","M","MO50","00:59:58",55.362598488502982]
[44,4,"Les Pugh","MDC","M","M060","01:05:05",{"$f":"(2-(G45/I$1))*100","v":43.021386074931669}]
[45,35,"Elizabeth Iefrat","U/A","F","FU40","01:07:46",{"$f":"(2-(G46/I$1))*100","v":36.54928445087635}]
[46,37,"Antol Sandor","Mynydd Du","M","MO40","01:10:13",30.639974272391047]

{"sheet":"Craig Yr Allt","index":5,"n_rows":1,"n_cols":8,"rows_kept":1,"cut":false,"hidden":false,"merged":[]}
["Position","Number","Name","Club","Category","Time","Points",{"$f":"AVERAGE(F2:F6)","v":{"$error":"#DIV/0!"}}]

{"sheet":"Tintern Trot","index":6,"n_rows":1,"n_cols":8,"rows_kept":1,"cut":false,"hidden":false,"merged":[]}
["Position","Number","Name","Club","Category","Time","Points",{"$f":"AVERAGE(F2:F6)","v":{"$error":"#DIV/0!"}}]