{"text_format":"1","workbook":"xlsx","n_sheets":7,"sheets":["Series Table","Blorenge Downhill","Blorenge Uphill","Pentyrch Hill Race","Mynydd Pen Y Fal","Craig Yr Allt","Tintern Trot"],"not_rendered":{"charts":0,"images":1,"macros":1,"external_links":1,"defined_names":26,"comments":0,"pivot_tables":0},"unopened":[],"bounds":{"document_bytes":16777216,"sheet_cells":100000,"rows_first":2000,"rows_last":500,"rows_between":2000,"halvings":0,"cell_chars":16384,"cell_head_chars":4096},"cells_cut":0,"cells_raw":0,"read":"whole","date_system":"1900"}

{"sheet":"Series Table","index":0,"n_rows":324,"n_cols":19,"rows_kept":324,"cut":false,"hidden":false,"merged":[]}
[null,"South Wales 2016 Mid Week Series",null,null,null,null,"Blorenge Downhill",null,"Blorenge Uphill",null,"Pentyrch Hill Race",null,"Mynydd Pen Y Fal",null,"Craig Yr Allt",null,"Tintern Trot"]
["Pos","Name","Club","Gender","Cat.","Total","Time","Score","Time","Score","Time","Score","Time","Score","Time","Score","Time","Competed","Ave (Best 4)"]
[{"$f":"ROW(A1)","v":1},"Matt Stott",{"$f":"IFERROR(VLOOKUP(B3,INDIRECT(\"'\"&$G$1&\"'!\"&\"$C$2:$H$200\"),2,FALSE),\"\")","v":"MDC"},{"$f":"IFERROR(VLOOKUP(B3,INDIRECT(\"'\"&$G$1&\"'!\"&\"$C$2:$H$200\"),3,FALSE),\"\")","v":"M"},{"$f":"IFERROR(VLOOKUP(B3,INDIRECT(\"'\"&$G$1&\"'!\"&\"$C$2:$H$200\"),4,FALSE),\"\")","v":"MU40"},{"$f":"SUM(LARGE((H3,J3,L3,N3,P3),{1,2,3,4,5}))","v":312.98625046838691},{"$f":"IFERROR(VLOOKUP(B3,INDIRECT(\"'\"&$G$1&\"'!\"&\"$C$2:$H$200\"),5,FALSE),\"\")","v":"00:14:16"},{"$f":"IFERROR(VLOOKUP(B3,INDIRECT(\"'\"&$G$1&\"'!\"&\"$C$2:$H$200\"),6,FALSE),0)","v":108.03609798023204},{"$f":"IFERROR(VLOOKUP(B3,INDIRECT(\"'\"&$I$1&\"'!\"&\"$C$2:$G$200\"),5,FALSE),\"\")","v":1.9594907407407405E-2},{"$f":"IFERROR(VLOOKUP(B3,INDIRECT(\"'\"&$I$1&\"'!\"&\"$C$2:$H$200\"),6,FALSE),0)","v":105.40842552240477},{"$f":"IFERROR(VLOOKUP(B3,INDIRECT(\"'\"&$K$1&\"'!\"&\"$C$2:$G$400\"),5,FALSE),\"\")","v":""},{"$f":"IFERROR(VLOOKUP(B3,INDIRECT(\"'\"&$K$1&\"'!\"&\"$C$2:$H$400\"),6,FALSE),0)","v":0},{"$f":"IFERROR(VLOOKUP(B3,INDIRECT(\"'\"&$M$1&\"'!\"&\"$C$2:$H$200\"),5,FALSE),\"\")","v":2.8923611111111108E-2},{"$f":"IFERROR(VLOOKUP(B3,INDIRECT(\"'\"&$M$1&\"'!\"&\"$C$2:$H$200\"),6,FALSE),0)","v":99.541726965750115},{"$f":"IFERROR(VLOOKUP(B3,INDIRECT(\"'\"&$O$1&\"'!\"&\"$C$2:$G$200\"),4,FALSE),\"\")","v":""},{"$f":"IFERROR(VLOOKUP(B3,INDIRECT(\"'\"&$O$1&\"'!\"&\"$C$2:$G$200\"),5,FALSE),0)","v":0},{"$f":"IFERROR(VLOOKUP(B3,INDIRECT(\"'\"&$Q$1&\"'!\"&\"$C$2:$G$200\"),4,FALSE),\"\")","v":""},{"$f":"6-COUNTIF(G3:Q3,\"\")","v":3},{"$f":"F3/IF(R3>4,5,R3)","v":104.32875015612898}]
[2,"Paul Tucker","U/A","M","MO50",{"$f":"SUM(LARGE((H4,J4,L4,N4,P4),{1,2,3,4,5}))","v":259.39313323987642},"00:17:19",88.375590889557373,2.5416666666666667E-2,77.304726785115662,"",0,3.0601851851851852E-2,93.712815565203414,"",0,"",3,86.464377746625473]
[3,"Mark Buxton","MDC","M","MU40",{"$f":"SUM(LARGE((H5,J5,L5,N5,P5),{1,2,3,4,5}))","v":235.31744531537899},"00:19:22",75.161151697464561,2.478009259259259E-2,80.377695831936563,2.2624999999999997,79.778597785977865,"",0,"",0,"",3,78.439148438459668]
[4,"Chris Jones","MDC","M","MU40",{"$f":"SUM(LARGE((H6,J6,L6,N6,P6),{1,2,3,4,5}))","v":210.65522514225313},"00:14:17",107.92866351525569,2.0150462962962964E-2,102.72656162699745,"",0,"",0,"",0,"",2,105.32761257112656]
[5,"Andy Stott","MDC","M","M050",{"$f":"SUM(LARGE((H7,J7,L7,N7,P7),{1,2,3,4,5}))","v":206.79310882539019},"00:19:36",73.657069187795415,3.005787037037037E-2,54.899988825567128,"",0,3.5057870370370371E-2,78.236050812027642,"",0,"",3,68.931036275130069]
[6,"Paul Murrin","Chepstow Harriers","M","MO40",{"$f":"SUM(LARGE((H8,J8,L8,N8,P8),{1,2,3,4,5}))","v":204.18361019467477},"00:15:37",99.333906317146543,1.9710648148148147E-2,104.84970387752823,"",0,"",0,"",0,"",2,102.09180509733739]
[7,"Iwan Morton",{"$f":"IFERROR(VLOOKUP(B9,INDIRECT(\"'\"&$M$1&\"'!\"&\"$C$2:$H$400\"),2,FALSE),\"\")","v":"MMRT"},{"$f":"IFERROR(VLOOKUP(B9,INDIRECT(\"'\"&$M$1&\"'!\"&\"$C$2:$H$400\"),3,FALSE),\"\")","v":"M"},{"$f":"IFERROR(VLOOKUP(B9,INDIRECT(\"'\"&$M$1&\"'!\"&\"$C$2:$H$400\"),4,FALSE),\"\")","v":"MU40"},{"$f":"SUM(LARGE((H9,J9,L9,N9,P9),{1,2,3,4,5}))","v":200.40240923393313},"",0,"",0,1.8854166666666667,99.81549815498154,2.8622685185185185E-2,100.58691107895159,"",0,"",2,100.20120461696656]
[8,"Oscar Partridge",{"$f":"IFERROR(VLOOKUP(B10,INDIRECT(\"'\"&$K$1&\"'!\"&\"$C$2:$H$200\"),2,FALSE),\"\")","v":"Mynydd Du"},{"$f":"IFERROR(VLOOKUP(B10,INDIRECT(\"'\"&$K$1&\"'!\"&\"$C$2:$H$200\"),3,FALSE),\"\")","v":"M"},{"$f":"IFERROR(VLOOKUP(B10,INDIRECT(\"'\"&$K$1&\"'!\"&\"$C$2:$H$200\"),4,FALSE),\"\")","v":"MU40"},{"$f":"SUM(LARGE((H10,J10,L10,N10,P10),{1,2,3,4,5}))","v":197.11558852202126},"",0,"",0,1.9381944444444443,97.011070110701112,2.8761574074074075E-2,100.10451841132016,"",0,"",2,98.557794261010628]
[9,"David Jenkins",{"$f":"IFERROR(VLOOKUP(B11,INDIRECT(\"'\"&$G$1&\"'!\"&\"$C$2:$H$200\"),2,FALSE),\"\")","v":"Forest of Dean Athletics Club"},{"$f":"IFERROR(VLOOKUP(B11,INDIRECT(\"'\"&$G$1&\"'!\"&\"$C$2:$H$200\"),3,FALSE),\"\")","v":"M"},{"$f":"IFERROR(VLOOKUP(B11,INDIRECT(\"'\"&$G$1&\"'!\"&\"$C$2:$H$200\"),4,FALSE),\"\")","v":"MU40"},{"$f":"SUM(LARGE((H11,J11,L11,N11,P11),{1,2,3,4,5}))","v":195.26581919138101},"00:22:16",56.467554791577143,2.8518518518518523E-2,62.330986702424852,"",0,3.5567129629629629E-2,76.467277697379004,"",0,"",3,65.088606397127009]
[10,"Ed Dickson",{"$f":"IFERROR(VLOOKUP(B12,INDIRECT(\"'\"&$G$1&\"'!\"&\"$C$2:$H$200\"),2,FALSE),\"\")","v":"MDC"},{"$f":"IFERROR(VLOOKUP(B12,INDIRECT(\"'\"&$G$1&\"'!\"&\"$C$2:$H$200\"),3,FALSE),\"\")","v":"M"},{"$f":"IFERROR(VLOOKUP(B12,INDIRECT(\"'\"&$G$1&\"'!\"&\"$C$2:$H$200\"),4,FALSE),\"\")","v":"MU40"},{"$f":"SUM(LARGE((H12,J12,L12,N12,P12),{1,2,3,4,5}))","v":182.20939043252457},"00:16:38",92.780403953588333,2.2905092592592591E-2,89.428986478936224,"",0,"",0,"",0,"",2,91.104695216262286]
[11,"Ian Macklin",{"$f":"IFERROR(VLOOKUP(B13,INDIRECT(\"'\"&$K$1&\"'!\"&\"$C$2:$H$200\"),2,FALSE),\"\")","v":"Mynyddwyr de Cymru"},{"$f":"IFERROR(VLOOKUP(B13,INDIRECT(\"'\"&$K$1&\"'!\"&\"$C$2:$H$200\"),3,FALSE),\"\")","v":"M"},{"$f":"IFERROR(VLOOKUP(B13,INDIRECT(\"'\"&$K$1&\"'!\"&\"$C$2:$H$200\"),4,FALSE),\"\")","v":"MO40"},{"$f":"SUM(LARGE((H13,J13,L13,N13,P13),{1,2,3,4,5}))","v":180.53681463008553},"",0,"",0,2.2562500000000001,80.110701107011067,2.8668981481481479E-2,100.42611352307445,"",0,"",2,90.268407315042765]
[12,"John Aggleton",{"$f":"IFERROR(VLOOKUP(B14,INDIRECT(\"'\"&$K$1&\"'!\"&\"$C$2:$H$200\"),2,FALSE),\"\")","v":"Mynyddwyr de Cymru"},{"$f":"IFERROR(VLOOKUP(B14,INDIRECT(\"'\"&$K$1&\"'!\"&\"$C$2:$H$200\"),3,FALSE),\"\")","v":"M"},{"$f":"IFERROR(VLOOKUP(B14,INDIRECT(\"'\"&$K$1&\"'!\"&\"$C$2:$H$200\"),4,FALSE),\"\")","v":"MO60"},{"$f":"SUM(LARGE((H14,J14,L14,N14,P14),{1,2,3,4,5}))","v":180.37394035300696},"",0,"",0,2.2388888888888889,81.033210332103309,2.8981481481481483E-2,99.340730020903663,"",0,"",2,90.186970176503479]
[13,"Martin Driscoll",{"$f":"IFERROR(VLOOKUP(B15,INDIRECT(\"'\"&$G$1&\"'!\"&\"$C$2:$H$200\"),2,FALSE),\"\")","v":"MDC"},{"$f":"IFERROR(VLOOKUP(B15,INDIRECT(\"'\"&$G$1&\"'!\"&\"$C$2:$H$200\"),3,FALSE),\"\")","v":"M"},{"$f":"IFERROR(VLOOKUP(B15,INDIRECT(\"'\"&$G$1&\"'!\"&\"$C$2:$H$200\"),4,FALSE),\"\")","v":"MU40"},{"$f":"SUM(LARGE((H15,J15,L15,N15,P15),{1,2,3,4,5}))","v":179.61787761359636},"00:16:46",91.920928233777403,2.326388888888889E-2,87.696949379818975,"",0,"",0,"",0,"",2,89.808938806798182]
[14,"Helen Brown",{"$f":"IFERROR(VLOOKUP(B16,INDIRECT(\"'\"&$G$1&\"'!\"&\"$C$2:$H$200\"),2,FALSE),\"\")","v":"Mynydd Du"},{"$f":"IFERROR(VLOOKUP(B16,INDIRECT(\"'\"&$G$1&\"'!\"&\"$C$2:$H$200\"),3,FALSE),\"\")","v":"F"},{"$f":"IFERROR(VLOOKUP(B16,INDIRECT(\"'\"&$G$1&\"'!\"&\"$C$2:$H$200\"),4,FALSE),\"\")","v":"FO40"},{"$f":"SUM(LARGE((H16,J16,L16,N16,P16),{1,2,3,4,5}))","v":177.55507345905073},"00:17:00",90.416845724108285,2.3379629629629629E-2,87.138227734942461,"",0,"",0,"",0,"",2,88.777536729525366]
[15,"Mark Burley",{"$f":"IFERROR(VLOOKUP(B17,INDIRECT(\"'\"&$G$1&\"'!\"&\"$C$2:$H$200\"),2,FALSE),\"\")","v":"Bristol and West Athletics Club"},{"$f":"IFERROR(VLOOKUP(B17,INDIRECT(\"'\"&$G$1&\"'!\"&\"$C$2:$H$200\"),3,FALSE),\"\")","v":"M"},{"$f":"IFERROR(VLOOKUP(B17,INDIRECT(\"'\"&$G$1&\"'!\"&\"$C$2:$H$200\"),4,FALSE),\"\")","v":"MU40"},{"$f":"SUM(LARGE((H17,J17,L17,N17,P17),{1,2,3,4,5}))","v":176.73469865022747},"00:17:43",85.797163730124623,2.2592592592592591E-2,90.937534920102834,"",0,"",0,"",0,"",2,88.367349325113736]
[16,"Oliver Lamford",{"$f":"IFERROR(VLOOKUP(B18,INDIRECT(\"'\"&$K$1&\"'!\"&\"$C$2:$H$200\"),2,FALSE),\"\")","v":"Mynyddwyr de Cymru"},{"$f":"IFERROR(VLOOKUP(B18,INDIRECT(\"'\"&$K$1&\"'!\"&\"$C$2:$H$200\"),3,FALSE),\"\")","v":"M"},{"$f":"IFERROR(VLOOKUP(B18,INDIRECT(\"'\"&$K$1&\"'!\"&\"$C$2:$H$200\"),4,FALSE),\"\")","v":"MU40"},{"$f":"SUM(LARGE((H18,J18,L18,N18,P18),{1,2,3,4,5}))","v":167.68180359082893},"",0,"",0,2.4104166666666669,71.918819188191875,3.0011574074074076E-2,95.762984402637059,"",0,"",2,83.840901795414467]
[17,"Gary Davies",{"$f":"IFERROR(VLOOKUP(B19,INDIRECT(\"'\"&$K$1&\"'!\"&\"$C$2:$H$200\"),2,FALSE),\"\")","v":"Mynyddwyr de Cymru"},{"$f":"IFERROR(VLOOKUP(B19,INDIRECT(\"'\"&$K$1&\"'!\"&\"$C$2:$H$200\"),3,FALSE),\"\")","v":"M"},{"$f":"IFERROR(VLOOKUP(B19,INDIRECT(\"'\"&$K$1&\"'!\"&\"$C$2:$H$200\"),4,FALSE),\"\")","v":"MU40"},{"$f":"SUM(LARGE((H19,J19,L19,N19,P19),{1,2,3,4,5}))","v":167.22641423230442},"",0,"",0,2.4076388888888887,72.06642066420666,3.0185185185185186E-2,95.159993568097761,"",0,"",2,83.613207116152211]
[18,"Andrew Dickens",{"$f":"IFERROR(VLOOKUP(B20,INDIRECT(\"'\"&$K$1&\"'!\"&\"$C$2:$H$200\"),2,FALSE),\"\")","v":"Mynydd Du"},{"$f":"IFERROR(VLOOKUP(B20,INDIRECT(\"'\"&$K$1&\"'!\"&\"$C$2:$H$200\"),3,FALSE),\"\")","v":"M"},{"$f":"IFERROR(VLOOKUP(B20,INDIRECT(\"'\"&$K$1&\"'!\"&\"$C$2:$H$200\"),4,FALSE),\"\")","v":"MO40"},{"$f":"SUM(LARGE((H20,J20,L20,N20,P20),{1,2,3,4,5}))","v":166.76626028199502},"",0,"",0,2.3784722222222223,73.616236162361616,3.0763888888888886E-2,93.1500241196334,"",0,"",2,83.383130140997508]
[19,"Andrew Dickens",{"$f":"IFERROR(VLOOKUP(B21,INDIRECT(\"'\"&$M$1&\"'!\"&\"$C$2:$H$400\"),2,FALSE),\"\")","v":"Mynydd Du"},{"$f":"IFERROR(VLOOKUP(B21,INDIRECT(\"'\"&$M$1&\"'!\"&\"$C$2:$H$400\"),3,FALSE),\"\")","v":"M"},{"$f":"IFERROR(VLOOKUP(B21,INDIRECT(\"'\"&$M$1&\"'!\"&\"$C$2:$H$400\"),4,FALSE),\"\")","v":"MO40"},{"$f":"SUM(LARGE((H21,J21,L21,N21,P21),{1,2,3,4,5}))","v":166.76626028199502},"",0,"",0,2.3784722222222223,73.616236162361616,3.0763888888888886E-2,93.1500241196334,"",0,"",2,83.383130140997508]
[20,"Jamie Clode",{"$f":"IFERROR(VLOOKUP(B22,INDIRECT(\"'\"&$K$1&\"'!\"&\"$C$2:$H$200\"),2,FALSE),\"\")","v":"Bridgend AC"},{"$f":"IFERROR(VLOOKUP(B22,INDIRECT(\"'\"&$K$1&\"'!\"&\"$C$2:$H$200\"),3,FALSE),\"\")","v":"M"},{"$f":"IFERROR(VLOOKUP(B22,INDIRECT(\"'\"&$K$1&\"'!\"&\"$C$2:$H$200\"),4,FALSE),\"\")","v":"MU40"},{"$f":"SUM(LARGE((H22,J22,L22,N22,P22),{1,2,3,4,5}))","v":166.18502161866772},"",0,"",0,2.2645833333333334,79.667896678966784,3.2673611111111105E-2,86.517124939700935,"",0,"",2,83.092510809333859]
[21,"Jamie Clode",{"$f":"IFERROR(VLOOKUP(B23,INDIRECT(\"'\"&$M$1&\"'!\"&\"$C$2:$H$400\"),2,FALSE),\"\")","v":"Bridgend AC"},{"$f":"IFERROR(VLOOKUP(B23,INDIRECT(\"'\"&$M$1&\"'!\"&\"$C$2:$H$400\"),3,FALSE),\"\")","v":"M"},{"$f":"IFERROR(VLOOKUP(B23,INDIRECT(\"'\"&$M$1&\"'!\"&\"$C$2:$H$400\"),4,FALSE),\"\")","v":"MU40"},{"$f":"SUM(LARGE((H23,J23,L23,N23,P23),{1,2,3,4,5}))","v":166.18502161866772},"",0,"",0,2.2645833333333334,79.667896678966784,3.2673611111111105E-2,86.517124939700935,"",0,"",2,83.092510809333859]
[22,"Steve Harrhy",{"$f":"IFERROR(VLOOKUP(B24,INDIRECT(\"'\"&$G$1&\"'!\"&\"$C$2:$H$200\"),2,FALSE),\"\")","v":"Pontypool"},{"$f":"IFERROR(VLOOKUP(B24,INDIRECT(\"'\"&$G$1&\"'!\"&\"$C$2:$H$200\"),3,FALSE),\"\")","v":"M"},{"$f":"IFERROR(VLOOKUP(B24,INDIRECT(\"'\"&$G$1&\"'!\"&\"$C$2:$H$200\"),4,FALSE),\"\")","v":"MO50"},{"$f":"SUM(LARGE((H24,J24,L24,N24,P24),{1,2,3,4,5}))","v":156.5651594051821},"00:18:09",83.003867640739145,2.6192129629629631E-2,73.56129176444297,"",0,"",0,"",0,"",2,78.28257970259105]
[23,"Lou Summers",{"$f":"IFERROR(VLOOKUP(B25,INDIRECT(\"'\"&$K$1&\"'!\"&\"$C$2:$H$200\"),2,FALSE),\"\")","v":"Mynydd Du"},{"$f":"IFERROR(VLOOKUP(B25,INDIRECT(\"'\"&$K$1&\"'!\"&\"$C$2:$H$200\"),3,FALSE),\"\")","v":"F"},{"$f":"IFERROR(VLOOKUP(B25,INDIRECT(\"'\"&$K$1&\"'!\"&\"$C$2:$H$200\"),4,FALSE),\"\")","v":"FO40"},{"$f":"SUM(LARGE((H25,J25,L25,N25,P25),{1,2,3,4,5}))","v":156.53215446770969},"",0,"",0,2.4243055555555553,71.180811808118108,3.3009259259259259E-2,85.351342659591566,"",0,"",2,78.266077233854844]
[24,"Rona Davies",{"$f":"IFERROR(VLOOKUP(B26,INDIRECT(\"'\"&$G$1&\"'!\"&\"$C$2:$H$200\"),2,FALSE),\"\")","v":"Mynydd Du"},{"$f":"IFERROR(VLOOKUP(B26,INDIRECT(\"'\"&$G$1&\"'!\"&\"$C$2:$H$200\"),3,FALSE),\"\")","v":"F"},{"$f":"IFERROR(VLOOKUP(B26,INDIRECT(\"'\"&$G$1&\"'!\"&\"$C$2:$H$200\"),4,FALSE),\"\")","v":"FU40"},{"$f":"SUM(LARGE((H26,J26,L26,N26,P26),{1,2,3,4,5}))","v":147.80323382058378},"00:21:42",60.120326600773531,"",0,"",0,3.2337962962962964E-2,87.682907219810247,"",0,"",2,73.901616910291892]
[25,"Daniel Morgan",{"$f":"IFERROR(VLOOKUP(B27,INDIRECT(\"'\"&$K$1&\"'!\"&\"$C$2:$H$200\"),2,FALSE),\"\")","v":"Bridgend AC"},{"$f":"IFERROR(VLOOKUP(B27,INDIRECT(\"'\"&$K$1&\"'!\"&\"$C$2:$H$200\"),3,FALSE),\"\")","v":"M"},{"$f":"IFERROR(VLOOKUP(B27,INDIRECT(\"'\"&$K$1&\"'!\"&\"$C$2:$H$200\"),4,FALSE),\"\")","v":"MU40"},{"$f":"SUM(LARGE((H27,J27,L27,N27,P27),{1,2,3,4,5}))","v":140.40510303800579},"",0,"",0,2.7951388888888888,51.476014760147606,3.1979166666666663E-2,88.929088277858199,"",0,"",2,70.202551519002895]
[26,"Daniel Morgan",{"$f":"IFERROR(VLOOKUP(B28,INDIRECT(\"'\"&$M$1&\"'!\"&\"$C$2:$H$400\"),2,FALSE),\"\")","v":"Bridgend AC"},{"$f":"IFERROR(VLOOKUP(B28,INDIRECT(\"'\"&$M$1&\"'!\"&\"$C$2:$H$400\"),3,FALSE),\"\")","v":"M"},{"$f":"IFERROR(VLOOKUP(B28,INDIRECT(\"'\"&$M$1&\"'!\"&\"$C$2:$H$400\"),4,FALSE),\"\")","v":"MU40"},{"$f":"SUM(LARGE((H28,J28,L28,N28,P28),{1,2,3,4,5}))","v":140.40510303800579},"",0,"",0,2.7951388888888888,51.476014760147606,3.1979166666666663E-2,88.929088277858199,"",0,"",2,70.202551519002895]
[27,"Karen Elvers",{"$f":"IFERROR(VLOOKUP(B29,INDIRECT(\"'\"&$K$1&\"'!\"&\"$C$2:$H$200\"),2,FALSE),\"\")","v":"Mynyddwyr de Cymru"},{"$f":"IFERROR(VLOOKUP(B29,INDIRECT(\"'\"&$K$1&\"'!\"&\"$C$2:$H$200\"),3,FALSE),\"\")","v":"F"},{"$f":"IFERROR(VLOOKUP(B29,INDIRECT(\"'\"&$K$1&\"'!\"&\"$C$2:$H$200\"),4,FALSE),\"\")","v":"FO40"},{"$f":"SUM(LARGE((H29,J29,L29,N29,P29),{1,2,3,4,5}))","v":132.05939541305688},"",0,"",0,2.6715277777777775,58.044280442804428,3.6273148148148145E-2,74.015114970252455,"",0,"",2,66.029697706528438]
[28,"John Price",{"$f":"IFERROR(VLOOKUP(B30,INDIRECT(\"'\"&$G$1&\"'!\"&\"$C$2:$H$200\"),2,FALSE),\"\")","v":"Hay Hotfooters"},{"$f":"IFERROR(VLOOKUP(B30,INDIRECT(\"'\"&$G$1&\"'!\"&\"$C$2:$H$200\"),3,FALSE),\"\")","v":"M"},{"$f":"IFERROR(VLOOKUP(B30,INDIRECT(\"'\"&$G$1&\"'!\"&\"$C$2:$H$200\"),4,FALSE),\"\")","v":"MO50"},{"$f":"SUM(LARGE((H30,J30,L30,N30,P30),{1,2,3,4,5}))","v":123.36212625365262},"00:23:35",47.980232058444372,"",0,"",0,3.5879629629629629E-2,75.381894195208247,"",0,"",2,61.681063126826309]
{"$rows_left_out":295}
{"sheet":"Blorenge Downhill","index":1,"n_rows":21,"n_cols":9,"rows_kept":21,"cut":false,"hidden":false,"merged":[]}
["Position","Number","Name","Club","Gender","Category","Time","Points",{"$f":"AVERAGE(G2:G6)","v":"00:15:30.800"}]
[1,223,"Matt Stott","MDC","M","MU40","00:14:16",{"$f":"(2-(G2/LLYNYFANTOP5))*100","v":108.03609798023204}]
[{"$f":"A2+1","v":2},221,"Chris Jones","MDC","M","MU40","00:14:17",107.92866351525569]
[3,220,"Paul Murrin","Chepstow Harriers","M","MO40","00:15:37",99.333906317146543]
[4,217,"Ed Dickson","MDC","M","MU40","00:16:38",92.780403953588333]
[5,225,"Martin Driscoll","MDC","M","MU40","00:16:46",91.920928233777403]
[6,216,"Helen Brown","Mynydd Du","F","FO40","00:17:00",90.416845724108285]
[7,214,"Paul Tucker","U/A","M","MO50","00:17:19",88.375590889557373]
[8,218,"Mark Burley","Bristol and West Athletics Club","M","MU40","00:17:43",85.797163730124623]
[9,233,"Steve Harrhy","Pontypool","M","MO50","00:18:09",83.003867640739145]
[10,227,"Jonathon Like","U/A","M","MU40","00:18:34",80.318006016330031]
[11,226,"Mark Buxton","MDC","M","MU40","00:19:22",75.161151697464561]
[12,229,"Andy Stott","MDC","M","M050","00:19:36",73.657069187795415]
[13,213,"Gary Gunner","Croft Ambrey","M","M070","00:19:50",72.152986678126354]
[14,231,"Sasha Habgood","MDC","F","FO40","00:20:40",66.781263429308126]
[15,222,"Meshari Alsaeed","MDC","M","MU23","00:21:36",60.76493339063169]
[16,215,"Rona Davies","Mynydd Du","F","FU40","00:21:42",60.120326600773531]
[17,224,"Katy Benson","MDC","F","FU40","00:22:01",58.079071766222597]
[18,230,"David Jenkins","Forest of Dean Athletics Club","M","MU40","00:22:16",56.467554791577143]
[19,232,"John Price","Hay Hotfooters","M","MO50","00:23:35",47.980232058444372]
[20,228,"Harriet Like","U/A","F","FO40","00:28:59",13.171465406102257]

{"sheet":"Blorenge Uphill","index":2,"n_rows":73,"n_cols":15,"rows_kept":73,"cut":false,"hidden":false,"merged":[]}
[null,"Number","Name","Club","Gender","Category","Time","Points",{"$f":"AVERAGE(G2:G6)","v":"00:29:49.800"}]
[1,223,"Matt Stott","MDC","M","MU40","00:28:13",{"$f":"(2-(G2/I$1))*100","v":105.40842552240477}]
[2,221,"Chris Jones","MDC","M","MU40","00:29:01",102.72656162699745]
[3,220,"Paul Murrin","Chepstow Harriers","M","MO40","00:28:23",104.84970387752823]
[4,219,"Tim Hindle","Brecon","M","MO40","00:31:00",96.077774052966802]
[5,218,"Mark Burley","Bristol and West Athletics Club","M","MU40","00:32:32",90.937534920102834]
[6,217,"Ed Dickson","MDC","M","MU40","00:32:59",89.428986478936224]
[7,225,"Martin Driscoll","MDC","M","MU40","00:33:30",{"$f":"(2-(G8/I$1))*100","v":87.696949379818975}]
[8,216,"Helen Brown","Mynydd Du","F","FO40","00:33:40",87.138227734942461]
[9,226,"Mark Buxton","MDC","M","MU40","00:35:41",80.377695831936563]
[10,214,"Paul Tucker","U/A","M","MO50","00:36:36",77.304726785115662]
[11,233,"Steve Harrhy","Pontypool","M","MO50","00:37:43",73.56129176444297]
[12,230,"David Jenkins","Forest of Dean Athletics Club","M","MU40","00:41:04",62.330986702424852]
[13,229,"Andy Stott","MDC","M","M050","00:43:17",54.899988825567128]
[14,224,"Katy Benson","MDC","F","FU40","00:45:37",47.077885797295792]
[15,222,"Meshari Alsaeed","MDC","M","MU23","00:46:23",44.507766230863808]
[]
[]
[]
[]
[]
[]
[]
[]
[]
[]
[]
[]
[]
[]
{"$rows_left_out":44}
{"sheet":"Pentyrch Hill Race","index":3,"n_rows":278,"n_cols":9,"rows_kept":278,"cut":false,"hidden":false,"merged":[]}
["Position","Number","Name","Club","Gender","Cat","Time","Points",{"$f":"AVERAGE(G2:G5)","v":1.8819444444444444}]
[1,10,"Daniel Bodman","Aberdare VAAC","M","MU40",1.846527777777778,{"$f":"(2-(G2/I$1))*100","v":101.88191881918817}]
[2,86,"Peter Ryder","Cardiff AAC","M","MU40",1.8576388888888891,{"$f":"(2-(G3/I$1))*100","v":101.29151291512915}]
[3,4,"Iwan Morton","MMRT","M","MU40",1.8854166666666667,99.81549815498154]
[4,310,"Oscar Partridge","Mynydd Du","M","MU40",1.9381944444444443,97.011070110701112]
[5,101,"Thomas Burden","Unattached","M","MU40",1.95,96.383763837638384]
[6,96,"Jack Brown","Unattached","M","MU40",1.9937500000000001,94.059040590405885]
[7,78,"Darren Bishop","Pontypridd Roadents","M","MU40",2.0006944444444446,93.690036900368995]
[8,57,"Paul Graham","Pontypridd Roadents","M","MU40",2.0368055555555555,91.771217712177105]
[9,45,"Alun Wood","Mynydd Du","M","MU40",2.0791666666666666,89.520295202952042]
[10,140,"Gareth Crossway","Unattached","M","MU40",2.0826388888888889,89.335793357933582]
[11,182,"Lee Mills","Islwyn RC","M","MU40",2.088888888888889,89.003690036900366]
[12,181,"Dafydd Lambeth","Islwyn RC","M","MO40",2.1069444444444447,88.044280442804407]
[13,154,"Peter Coles","Pontypridd Roadents","M","MO50",2.125,87.084870848708491]
[14,58,"Clara Evans","Pontypridd Roadents","F","FU40",2.1305555555555555,86.789667896678964]
[15,7,"Owen Morris","Unattached","M","MU40",2.1381944444444447,86.383763837638355]
[16,275,"Philip Williams","Pontypridd Roadents","M","MU40",2.15,85.756457564575641]
[17,28,"Rob Sage","Les Croupiers RC","M","MU40",2.1541666666666668,85.535055350553506]
[18,188,"Andrew Jones","Unattached","M","MO40",2.1729166666666666,84.538745387453872]
[19,136,"Tim Hindle","Brecon","M","MO40",2.1750000000000003,84.428044280442791]
[20,79,"Neil Jones","Pontyclun Road Runners","M","MU40",2.1840277777777777,83.948339483394847]
[21,148,"Oliver Burrows","Unattached","M","MU40",2.1958333333333333,83.321033210332104]
[22,143,"Richard Jackson-Hookins","Penarth & Dinas Runners","M","MU40",2.1979166666666665,83.210332103321051]
[23,137,"Gethin Powell","White Rock Runners","M","MU40",2.1986111111111111,83.173431734317347]
[24,130,"Anthony Bannon","San Domenico RC","M","MU40",2.2006944444444447,83.062730627306252]
[25,274,"Karl James","Neath Harriers","M","MO50",2.2069444444444444,82.730627306273078]
[26,297,"Dave Buchanan","San Domenico RC","M","MU40",2.2131944444444445,82.398523985239862]
[27,157,"Malcom O'Brien","Unattached","M","MU40",2.2145833333333331,82.324723247232484]
[28,296,"Wayne Beynon","Unattached","M","MU40",2.2284722222222224,81.586715867158659]
[29,18,"John Aggleton","Mynyddwyr de Cymru","M","MO60",2.2388888888888889,81.033210332103309]
{"$rows_left_out":249}
{"sheet":"Mynydd Pen Y Fal","index":4,"n_rows":47,"n_cols":9,"rows_kept":47,"cut":false,"hidden":false,"merged":[]}
["Position","Number","Name","Club","Gender","Category","Time","Points",{"$f":"AVERAGE(G2:G6)","v":"00:41:27.600"}]
[1,31,"Iwan Morton","MMRT","M","MU40","00:41:13",{"$f":"(2-(G2/I$1))*100","v":100.58691107895159}]
[2,9,"Ian Macklin","MDC","M","M040","00:41:17",{"$f":"(2-(G3/I$1))*100","v":100.42611352307445}]
[3,10,"Oscar Partridge","Mynydd Du","M","MU40","00:41:25",100.10451841132016]
[4,29,"Matt Stott","MDC ","M","MU40","00:41:39",99.541726965750115]
[5,18,"John Aggleton","MDC","M","MO60","00:41:44",99.340730020903663]
[6,30,"Matthew Lawson","Chepstow Harriers","M","MO40","00:41:47",99.220131853995824]
[7,12,"Ricahrd Cronin","MDC","M","MU40","00:42:36",97.250361794500705]
[8,38,"Tim Woodier","Mynydd Du","M","MU40","00:42:41",97.049364849654296]
[9,23,"Oliver Lamford","MDC","M","MU40","00:43:13",95.762984402637059]
[10,28,"Jason King","LMRT","M","M040","00:43:15",95.682585624698518]
[11,27,"Mike Fawcett","LMRT","M","MO40","00:43:20",95.481588679852081]
[12,47,"Gary Davies","MDC","M","MU40","00:43:28",95.159993568097761]
[13,32,"Dan Sandford","Forest of Dean AC","M","MO40","00:43:45",94.476603955619879]
[14,5,"Andy Creber","Chepstow Harriers","M","MO50","00:43:51",94.235407621804157]
[15,1,"Julian Boon","Forest of Dean AC","M","MO40","00:43:59",93.913812510049837]
[16,8,"Paul Tucker","U/A","M","MO50","00:44:04",93.712815565203414]
[17,11,"James Woodier","Mynydd Du","M","MU40","00:44:13",93.351021064479809]
[18,43,"Andrew Dickens","Mynydd Du","M","MO40","00:44:18",93.1500241196334]
[19,17,"Emma Bayliss","Mynydd Du","F","FU40","00:45:09",91.099855282199727]
[20,36,"Roger Milss","Mynydd Du/Vegan Runners","M","MO40","00:45:23",90.53706383662967]
[21,33,"Mark Matthews","Forest of Dean AC","M","MO40","00:45:33",90.13506994693681]
[22,25,"Daniel Morgan","Bridgend AC","M","MU40","00:46:03",88.929088277858199]
[23,41,"Justin Ross","Mynydd Du","M","MU40","00:46:12",88.567293777134594]
[24,15,"Rona Davies","Mynydd Du","F","FO50","00:46:34",87.682907219810247]
[25,44,"Jamie Clode","Bridgend AC","M","MU40","00:47:03",86.517124939700935]
[26,16,"Hywel James","U/A","M","MU40","00:47:12",86.155330438977316]
[27,26,"Jon Thiel","Bridgend AC","M","MU40","00:47:27",85.552339604438004]
[28,42,"Lou Summers","Mynydd Du","F","FO40","00:47:32",85.351342659591566]
[29,46,"Thomas M","Mynydd Du","M","MU40","00:47:33",85.311143270622281]
{"$rows_left_out":18}
{"sheet":"Craig Yr Allt","index":5,"n_rows":1,"n_cols":8,"rows_kept":1,"cut":false,"hidden":false,"merged":[]}
["Position","Number","Name","Club","Category","Time","Points",{"$f":"AVERAGE(F2:F6)","v":{"$error":"#DIV/0!"}}]

{"sheet":"Tintern Trot","index":6,"n_rows":1,"n_cols":8,"rows_kept":1,"cut":false,"hidden":false,"merged":[]}
["Position","Number","Name","Club","Category","Time","Points",{"$f":"AVERAGE(F2:F6)","v":{"$error":"#DIV/0!"}}]